program: Gaussian 09
title: 000278343
version: EM64L-G09RevD.01
frameworkgroup: C1[X(C12H15NO2)]
method: RPBEPBE
basis: SDD
operation: Freq
keyword: #p
keyword: freq=noraman
keyword: PBEPBE/SDD
title: #p freq=noraman PBEPBE/SDD
converged: YES YES NO NO
title: Mulliken charges:
elementType: O O N C C C C C C C C C C C C H H H H H H H H H H H H H H H
charge: -0.263791 -0.260468 -0.031551 -0.620872 0.449383 -0.634159 -0.426041 0.426876 -0.390668 -0.039133 -0.808475 0.182668 -0.217121 -0.257681 -0.665516 0.307026 0.224456 0.256782 0.239367 0.223423 0.235327 0.223930 0.230304 0.230812 0.220929 0.233326 0.230528 0.219023 0.234467 0.246850
chargesum: 0.00000
title: Mulliken charges with hydrogens summed into heavy atoms:
elementType: O O N C C C C C C C C C C C C
charge: -0.263791 -0.260468 -0.031551 -0.089391 0.449383 -0.138010 0.032708 0.426876 -0.166738 -0.039133 -0.126430 0.182668 -0.217121 0.206173 0.034825
polarizability: 1.88297470e+02 8.88618934e+00 1.55891760e+02 -5.94513250e+00 1.75940263e+00 9.06337831e+01
1716.lowfreq: -10.6674 -0.0001 0.0003 0.0007 0.6398 5.7234 21.7604 31.6576 59.5244
frequency: 20.4530 31.5879 59.4407 68.7108 87.4507 99.7486 135.4570 164.3034 172.3906 220.1379 241.3482 256.0597 269.4554 297.3196 324.5507 370.7035 398.9660 419.5835 435.6980 492.1245 493.6508 507.3049 567.7824 593.1540 673.9945 734.3339 752.0504 778.7277 807.5618 815.7128 834.3716 893.8106 902.0953 915.5809 952.8745 1003.0520 1013.4111 1028.1428 1051.3902 1070.3069 1095.2196 1099.0887 1146.6981 1156.3075 1160.7481 1187.6715 1198.7344 1230.1988 1277.3842 1277.9308 1289.6549 1321.4959 1341.5849 1353.3470 1354.3224 1389.2894 1399.3827 1439.0189 1455.9450 1460.9811 1463.2690 1464.5142 1468.1624 1472.5243 1484.3970 1591.4419 1613.6366 1703.3846 2170.1822 2926.4674 2961.4471 2967.6365 2973.9782 2994.0109 3017.0595 3025.6964 3031.4434 3032.4514 3084.5021 3089.8104 3096.1179 3109.8105 3114.3700 3122.0767
redmass: 3.7817 3.5160 4.3487 3.7181 4.1130 3.4261 4.8955 2.0477 1.2544 1.3704 3.1276 2.9963 2.8572 3.4527 3.3947 3.2018 2.8301 2.6486 2.9160 4.7313 5.7497 8.7518 6.1653 4.5732 3.4976 3.1539 6.7392 1.7706 1.6484 1.4503 2.7865 2.6646 1.8697 2.3256 2.4514 1.9924 1.9247 1.9289 1.9740 3.1904 2.0872 1.9876 1.3480 1.6862 1.8716 3.3980 1.4826 1.8886 1.1668 1.3752 1.8834 1.5741 1.7862 1.7350 1.3138 1.2282 1.2357 1.0874 1.1010 1.0467 1.0437 1.0837 1.0957 1.0656 1.0517 7.2438 9.5105 6.7222 12.6387 1.0681 1.0379 1.0679 1.0628 1.0360 1.0883 1.0978 1.0599 1.0967 1.0981 1.0975 1.1027 1.0913 1.0935 1.1062
irintensity: 1.6272 0.4943 2.0409 1.2578 0.0638 0.5177 3.0494 1.5340 2.2009 1.7079 1.1909 0.5525 7.7631 5.0333 13.5756 4.7561 2.2062 1.1125 7.8220 0.7313 0.7782 1.5384 3.1633 1.7943 2.9706 6.7093 5.3766 28.4430 4.6220 2.4765 5.7854 1.0584 4.3921 4.0231 16.0677 2.1696 15.4035 67.7670 101.7638 92.2925 37.7533 12.2332 14.2109 49.0747 1.8347 223.4992 13.9420 83.3348 4.9030 7.9448 11.7369 0.9166 1.9202 15.4126 3.2189 23.9688 15.6809 14.5408 16.8098 16.3075 15.8999 7.0205 16.2095 22.1751 12.5564 173.8469 146.8055 7.4088 20.0641 9.5083 38.1247 12.0600 39.9122 20.0712 5.3597 32.6063 29.9168 23.9851 23.7923 35.2654 1.7489 35.9528 9.2038 27.7139
temp: 298.150 k
press: 1.00000 atm
elementType: 8 8 7 6 6 6 6 6 6 6 6 6 6 6 6 1 1 1 1 1 1 1 1 1 1 1 1 1 1 1
symmnumber: 1
zpe: 637419.3 jmol-1
zpe.correction: 0.242780 hartree
zpe.thermalcorrener: 0.258691 hartree
zpe.thermalcorrenthalpy: 0.259635 hartree
zpe.thermalcorrgfe: 0.197821 hartree
zpe.sumelectzpe: -670.321206 hartree
zpe.sumelectthermal: -670.305295 hartree
zpe.sumelectthermalent: -670.304351 hartree
zpe.sumelectthermalfe: -670.366165 hartree
dipole: -1.2088 -2.7934 0.6804
dipole: 3.1188
quadrupole: -68.9231 -103.4676 -87.4734
quadrupole: -2.0030 -1.8815 2.5453
quadrupole: 17.6983 -16.8462 -0.8521 -2.0030 -1.8815 2.5453
hfenergy: -670.5639867 hartree
pointgroup: C01 [X(C12H15N1O2)]
dipole: 0.3472673 -0.4849016 -1.0723379 debye
polarizability: 184.4212666|4.2356484|118.7581752|-18.5780193|31.9105384|131.6435707 unknown
InChI: InChI=1S/C12H15NO2/c1-3-15-12(14)11(8-13)10-6-4-5-9(2)7-10/h5H,3-4,6-7H2,1-2H3
charge 0 multiplicity 1
30 atoms
O  -2.641092 -0.523142 1.328679
O  -1.953566 -1.516577 -0.66328
N  -0.33214 1.297827 2.893565
C  0.87892 -1.009335 -1.375708
C  0.751702 -0.229665 -0.088268
C  2.022021 0.489416 0.330284
C  2.026137 -2.055624 -1.258129
C  3.306924 -0.279202 0.015549
C  3.288342 -1.447834 -0.680034
C  -0.397882 -0.142221 0.681755
C  4.577258 0.338288 0.563699
C  -1.699298 -0.80274 0.340389
C  -0.381248 0.637581 1.896895
C  -4.011161 -1.092797 1.137283
C  -4.868082 -0.15891 0.278308
H  -0.066919 -1.488549 -1.661634
H  1.165901 -0.291104 -2.172072
H  1.995551 0.736529 1.408897
H  2.055618 1.47365 -0.190988
H  2.229465 -2.468014 -2.265246
H  1.688938 -2.912097 -0.638636
H  4.230821 -1.987476 -0.846079
H  5.466983 -0.25423 0.290384
H  4.541981 0.415692 1.668375
H  4.720206 1.36801 0.179156
H  -3.915138 -2.091951 0.677116
H  -4.394771 -1.179022 2.165987
H  -5.903421 -0.544629 0.231861
H  -4.896745 0.85549 0.711457
H  -4.476405 -0.099862 -0.750871
