program: Gaussian 09
title: 000278332
version: EM64L-G09RevD.01
frameworkgroup: C1[X(C7H13ClN2OS2)]
method: RPBEPBE
basis: SDD
operation: Freq
keyword: #p
keyword: freq=noraman
keyword: PBEPBE/SDD
title: #p freq=noraman PBEPBE/SDD
converged: YES YES NO NO
title: Mulliken charges:
elementType: Cl S S O N N C C C C C C C H H H H H H H H H H H H H
charge: -0.085115 0.220386 0.199372 -0.327611 -0.371726 -0.393430 -0.041134 -0.685027 -0.710654 -0.858056 0.308181 -0.334720 -0.548469 0.278794 0.253858 0.303580 0.286021 0.257701 0.301752 0.297265 0.293558 0.302023 0.242414 0.266128 0.279816 0.265092
chargesum: 0.00000
title: Mulliken charges with hydrogens summed into heavy atoms:
elementType: Cl S S O N N C C C C C C C
charge: -0.085115 0.220386 0.199372 -0.327611 -0.069973 -0.091407 0.237660 -0.127589 -0.166931 -0.267233 0.308181 0.173822 -0.003561
polarizability: 1.51028991e+02 6.28963327e+00 1.31990387e+02 -2.27257433e+00 -7.01321800e+00 1.12265353e+02
1716.lowfreq: -13.8377 -8.0582 -0.0018 0.0027 0.0031 5.8336 15.0389 28.9306 43.2843
frequency: -6.5748 25.9263 43.0708 65.2202 87.9031 102.8482 157.5930 180.6159 204.7071 237.2469 272.8897 294.2527 331.0331 349.9255 399.9203 436.1007 463.6603 496.0404 559.6994 571.4352 596.0530 620.3934 627.3008 667.6187 682.8717 709.7180 736.5616 807.1431 832.4481 848.4341 890.1809 944.0591 967.3305 987.0731 1040.3270 1047.8853 1085.8784 1134.8980 1146.0209 1175.4608 1186.7092 1204.9196 1213.0266 1239.6590 1243.3628 1247.7914 1281.8341 1298.0604 1313.1661 1341.3873 1370.7514 1397.2292 1422.5614 1436.9717 1440.0154 1441.8014 1455.3397 1507.3940 1616.2841 2995.2656 3000.9582 3016.0342 3027.0540 3038.6170 3053.3214 3064.2849 3104.8551 3108.9307 3135.2826 3152.1634 3500.9700 3551.1854
redmass: 7.0939 5.6892 11.6332 8.9419 5.5881 3.5726 4.4280 4.9254 2.8307 5.3481 4.2482 2.8301 5.0975 2.0809 1.6786 2.6863 2.1034 2.7648 3.4035 1.7307 3.8739 5.2955 6.7341 7.2731 3.9834 8.0344 4.5619 1.5014 2.0171 1.7408 2.4606 2.4797 2.0755 2.4979 1.9061 1.6163 2.2816 1.0821 1.6048 1.4004 1.1094 1.2140 1.2642 1.3712 1.4854 1.6188 1.3190 1.1933 1.4359 1.2807 1.3152 1.0747 1.0834 1.1623 1.1054 1.0886 1.5349 2.4722 5.1669 1.0596 1.0793 1.0618 1.0624 1.0574 1.0908 1.0680 1.1039 1.1056 1.1080 1.1118 1.0771 1.0773
irintensity: 0.1901 0.6122 0.6022 10.6272 15.0566 6.2377 1.7100 1.4487 1.9680 9.9081 1.1379 12.5930 4.3723 10.1600 9.4349 0.6723 25.7862 4.4733 27.7156 118.2851 41.3392 13.1507 3.1533 55.3404 25.1105 8.4078 10.2070 4.5241 11.8417 2.3636 14.0495 0.8578 31.3660 5.0574 1.3398 1.8652 11.9602 7.8835 7.9922 6.8388 9.7274 15.7542 3.7598 100.2607 21.9297 95.8901 4.3392 24.7518 46.9320 23.0695 3.7112 7.8871 17.9681 40.7720 20.3214 13.9550 98.0325 706.6999 155.4136 48.6669 2.6044 16.2005 49.8228 19.1609 5.9869 22.8718 2.4146 12.0969 2.1623 16.4788 52.7173 23.7834
temp: 298.150 k
press: 1.00000 atm
elementType: 17 16 16 8 7 7 6 6 6 6 6 6 6 1 1 1 1 1 1 1 1 1 1 1 1 1
symmnumber: 1
zpe: 533743.4 jmol-1
zpe.correction: 0.203292 hartree
zpe.thermalcorrener: 0.217127 hartree
zpe.thermalcorrenthalpy: 0.218071 hartree
zpe.thermalcorrgfe: 0.160500 hartree
zpe.sumelectzpe: -1714.445354 hartree
zpe.sumelectthermal: -1714.431519 hartree
zpe.sumelectthermalent: -1714.430575 hartree
zpe.sumelectthermalfe: -1714.488146 hartree
dipole: 1.3498 0.0444 0.6698
dipole: 1.5075
quadrupole: -93.5650 -108.9756 -99.5050
quadrupole: 5.2608 3.7642 -0.1928
quadrupole: 7.1169 -8.2938 1.1769 5.2608 3.7642 -0.1928
hfenergy: -1714.6486462 hartree
pointgroup: C01 [X(C7H13Cl1N2O1S2)]
dipole: -0.5331009 0.076691 0.2483927 debye
dipolederiv: -0.3014613 0.0737372 -0.0299473 0.1993394 -0.5469004 0.0491495 -0.035503 -0.0059633 -0.2054499 -0.1706344 -0.0457048 -0.0067328 0.0076328 -0.2640567 0.1323153 -0.0815466 0.1301176 -0.2150776 -0.2534096 -0.0112561 -0.0416859 -0.1058096 -0.1885565 0.1351659 0.0211119 0.1157763 -0.3488978 -0.8731123 -0.053644 0.0438681 -0.0647633 -0.974346 -0.1197116 0.0966081 -0.1254795 -0.3979969 -1.589436 -0.1279099 0.1264085 -0.4749972 -0.4772291 0.232002 0.3200755 0.1585379 -0.4533985 -1.462207 0.2261542 0.1291855 0.4081926 -0.3986922 -0.1023631 0.3140734 -0.0820686 -0.5954668 0.6349835 -0.0957753 -0.014031 -0.4870854 -0.0059975 -0.1397968 -0.2674091 -0.1832282 0.1861307 0.0021248 0.0279345 0.1072564 0.1095278 0.1977733 0.1601017 0.092384 0.177605 0.0464343 0.0877248 0.1265479 0.009296 0.1613958 0.1924683 0.1260014 0.0300722 0.1608767 0.1470127 0.1796979 -0.0260191 -0.014773 0.0024767 0.2248778 -0.3213259 0.0358906 -0.3063557 0.3779034 2.4180175 0.0262909 -0.4059729 0.0255102 1.2676054 0.206894 -0.6063844 0.2211202 0.4096135 0.6829533 0.01258 -0.0849702 0.4168176 -0.11781 -0.0588501 -0.0885603 -0.027242 0.265962 0.172385 -0.1434633 0.0065621 -0.2622359 0.7403652 0.0162717 0.0054125 -0.0191965 0.1330377 0.0726403 -0.0678632 -0.0741703 0.0641731 0.0278731 -0.0504744 -0.0208948 -0.0177572 0.0240697 -0.1195689 0.0893464 0.029841 0.069738 0.006771 -0.0666221 0.0031897 -0.1307402 -0.0102045 0.0952902 -0.086563 0.036869 -0.0696073 0.0207023 0.0290597 0.0266324 0.0159099 0.0316604 0.0680834 0.0100493 -0.10234 -0.0027481 0.040956 0.032674 -0.0845819 0.0216568 -0.0236478 -0.109981 0.0405224 0.0811368 0.0294312 -0.0518712 -0.0978478 0.0303728 -0.0383472 0.0614515 0.2539823 -0.0178794 0.0258305 0.1214723 0.1561772 -0.0836446 0.0248943 -0.0838961 0.2400952 -0.0633444 0.0400641 0.0330924 0.1147378 -0.0202101 0.0391299 0.0917594 0.0405305 -0.0515779 0.0634901 -0.0520027 -0.0432606 -0.0694095 0.0131996 -0.027153 -0.0516956 -0.030178 0.0294217 0.1867547 -0.0213944 0.0791961 -0.0906139 0.1046443 -0.0128423 0.0933783 -0.0036749 0.3104055 -0.0868589 0.002416 0.0597989 -0.02037 0.1257295 -0.0656105 0.0959529 -0.0114481 -0.1167904 0.1475575 0.0716391 -0.0359226 -0.0968017 0.0200889 0.0116824 -0.0871022 0.0136219 0.1215271 0.1009645 0.040601 0.0592533 0.0473569 -0.0377795 -0.0286616 0.01548 -0.0178445 -0.0670489 -0.1366362 -0.038408 0.0262119 -0.0333601 -0.0557825 0.004456 0.0263902 0.0276675 0.1008316 unknown
polarizability: 151.3264329|6.2685812|133.9159678|0.8544043|0.0551927|110.0423301 unknown
InChI: InChI=1S/C7H13ClN2OS2/c8-1-2-9-7(11)10-6-3-12-5-13-4-6/h6,9-10H,1-5H2
charge 0 multiplicity 1
26 atoms
Cl 4.651938 -1.803908 0.035597
S  -2.864996 0.10025 -1.751695
S  -2.862257 -1.8500 0.739734
O  1.023567 1.917214 0.233535
N  -0.268568 -0.032519 0.238328
N  1.955687 -0.096251 -0.523745
C  -1.461282 0.670745 0.716625
C  -2.273478 1.324321 -0.433901
C  -2.307466 -0.257139 1.611815
C  -3.867561 -1.010392 -0.618187
C  0.90896 0.669614 -0.006736
C  3.260087 0.503608 -0.796551
C  4.346451 0.068479 0.188617
H  -1.099705 1.51046 1.342813
H  -3.154381 1.859951 -0.035669
H  -1.630934 2.037828 -0.974379
H  -1.718234 -0.60141 2.476661
H  -3.212818 0.263659 1.96902
H  -0.421566 -0.976935 -0.127999
H  -4.672827 -0.425329 -0.146076
H  -4.294114 -1.809579 -1.241717
H  1.874529 -1.111915 -0.595815
H  3.582729 0.277538 -1.83026
H  3.126355 1.598679 -0.705371
H  4.052205 0.228764 1.235629
H  5.31828 0.535168 -0.031772
