program: Gaussian 09
title: 000278400
version: EM64L-G09RevD.01
frameworkgroup: C1[X(C17H12Cl2N2O3)]
method: RPBEPBE
basis: SDD
operation: Freq
keyword: #p
keyword: freq=noraman
keyword: PBEPBE/SDD
title: #p freq=noraman PBEPBE/SDD
converged: YES YES NO NO
title: Mulliken charges:
elementType: Cl Cl O O O N N C C C C C C C C C C C C C C C C C H H H H H H H H H H H H
charge: 0.049986 -0.056489 -0.288557 -0.284011 -0.217601 -0.058587 -0.006274 0.145809 0.023313 -0.325726 0.358487 -0.204500 0.117333 -0.315733 -0.488775 0.173868 0.349278 -0.220029 -0.396976 -0.277288 -0.181816 -0.201726 -0.119218 -0.671319 0.279075 0.271180 0.287109 0.233209 0.234172 0.263032 0.332739 0.259336 0.258064 0.215993 0.229304 0.233340
chargesum: 0.00000
title: Mulliken charges with hydrogens summed into heavy atoms:
elementType: Cl Cl O O O N N C C C C C C C C C C C C C C C C C
charge: 0.049986 -0.056489 -0.288557 -0.284011 -0.217601 -0.058587 -0.006274 0.145809 0.023313 -0.325726 0.358487 0.074575 0.117333 -0.044553 -0.201666 0.173868 0.349278 0.247352 -0.133944 0.055451 0.077520 0.056337 -0.119218 0.007317
polarizability: 4.14904443e+02 5.59006687e+00 2.63155515e+02 -2.77213641e+00 4.39502491e+00 9.49206037e+01
1716.lowfreq: -1.4861 -0.0016 -0.0014 -0.0011 4.2123 5.0061 19.9245 29.8909 34.8556
frequency: 19.7510 29.8763 34.8413 41.5698 48.8679 65.9299 83.1819 90.1163 127.7261 134.9565 153.7514 175.5037 195.4914 208.9688 240.1239 262.6082 269.5166 282.8903 312.4646 329.9112 335.4257 343.9511 380.1305 413.8604 416.4222 430.8171 443.4878 498.4269 525.8234 551.4719 569.5068 584.0456 584.4320 619.0644 639.1884 669.6252 672.8954 697.3735 723.7432 737.1460 781.9210 799.8896 805.0534 807.0263 817.2131 820.5968 841.2917 846.7049 861.0528 945.6532 950.0220 966.7790 983.0837 983.2946 983.9776 994.7864 1025.9777 1068.1940 1099.9788 1102.8483 1112.4119 1124.5541 1135.6888 1145.2207 1177.8397 1198.3036 1213.8789 1249.9741 1252.8778 1284.0441 1289.2619 1338.3655 1351.4640 1360.3536 1373.0885 1395.5203 1403.1162 1407.0105 1416.7855 1457.6203 1461.9489 1464.1665 1473.6245 1486.2913 1511.3690 1564.9279 1579.8304 1593.3375 1601.5368 1626.4277 2997.3904 3011.9751 3071.2433 3093.8677 3109.1231 3161.8468 3167.8461 3168.9294 3173.4649 3181.2365 3190.6288 3202.0097
redmass: 6.6013 7.7372 4.1202 8.7546 7.6617 2.9570 5.0751 3.8451 4.6100 4.3561 9.5427 8.8331 8.4014 7.1010 1.5228 6.8888 4.5113 5.7564 6.8003 5.3796 7.9412 7.5478 4.6552 10.2188 3.1693 5.6450 5.4643 2.9364 5.7778 7.7504 5.5454 6.5113 9.1739 7.2992 7.3888 7.6305 5.7538 3.9238 8.3066 7.0337 7.3961 1.1333 4.0605 8.2741 4.2318 1.3690 1.3830 1.8465 6.3430 1.4441 1.3360 5.9010 4.7759 1.3417 1.3047 4.1916 2.6403 2.4953 1.5664 1.3020 2.2970 5.3801 1.4689 2.1809 1.4302 4.4598 2.7109 1.1351 3.0900 1.3304 2.9677 5.8141 2.2431 1.5955 6.9582 3.9583 1.2669 3.4809 8.2761 3.7035 2.3689 1.0400 1.0629 1.0678 7.7305 8.5414 7.2737 7.5237 7.1412 12.0170 1.0360 1.0583 1.1066 1.0985 1.1027 1.0887 1.0917 1.0893 1.0918 1.0978 1.0995 1.0953
irintensity: 0.9127 0.1831 0.0701 0.1377 0.1027 0.4694 1.2474 1.9662 2.5241 0.4779 0.3005 0.0125 0.5233 0.4742 0.9010 2.5989 10.3577 2.5945 3.2161 0.5132 12.7799 7.8388 3.9906 6.8634 0.6536 6.0302 4.5505 19.8574 3.8866 4.3290 1.5851 1.3258 7.6844 1.2049 2.5759 35.5376 13.0100 0.0105 19.0795 15.4800 5.6266 2.0598 14.9771 3.9737 0.8715 24.1773 78.9026 23.1467 28.0822 16.9753 1.7213 49.3396 18.5583 0.7825 3.0309 67.3754 137.6849 74.6822 111.1840 28.3027 15.1571 312.6983 5.8691 13.1952 12.3400 345.2601 42.2704 0.8318 254.5307 56.2330 212.1504 53.2235 13.5231 17.2021 7.7164 24.5152 38.2930 171.3413 12.0708 303.0327 240.5803 12.2021 5.9963 13.0053 20.5096 105.6172 15.1813 74.6138 53.7532 170.2369 21.9059 17.5172 6.3043 29.1856 40.8166 2.3119 1.5664 0.4635 0.4605 2.1303 2.8624 33.2450
temp: 298.150 k
press: 1.00000 atm
elementType: 17 17 8 8 8 7 7 6 6 6 6 6 6 6 6 6 6 6 6 6 6 6 6 6 1 1 1 1 1 1 1 1 1 1 1 1
symmnumber: 1
zpe: 663991.0 jmol-1
zpe.correction: 0.252901 hartree
zpe.thermalcorrener: 0.274321 hartree
zpe.thermalcorrenthalpy: 0.275265 hartree
zpe.thermalcorrgfe: 0.199308 hartree
zpe.sumelectzpe: -1908.616276 hartree
zpe.sumelectthermal: -1908.594856 hartree
zpe.sumelectthermalent: -1908.593911 hartree
zpe.sumelectthermalfe: -1908.669868 hartree
dipole: 2.9059 2.8594 0.6818
dipole: 4.1335
quadrupole: -131.1298 -147.3343 -154.8037
quadrupole: -17.7576 2.0929 -2.5304
quadrupole: 13.2928 -2.9117 -10.3811 -17.7576 2.0929 -2.5304
hfenergy: -1908.8691765 hartree
pointgroup: C01 [X(C17H12Cl2N2O3)]
dipole: -1.1326743 1.1450358 -0.2249422 debye
polarizability: 409.6404375|-13.3482794|262.2773718|-38.088678|-15.1113718|101.0627528 unknown
InChI: InChI=1S/C17H12Cl2N2O3/c1-2-23-17(22)12-9-20-13-7-8-14(21-16(13)15(12)19)24-11-5-3-10(18)4-6-11/h3-9H,2H2,1H3
charge 0 multiplicity 1
36 atoms
Cl -0.649066 -2.064707 0.481397
Cl 6.79669 -3.061564 -0.472343
O  2.906138 1.546306 -0.339888
O  -5.068999 -0.971697 0.621505
O  -3.491338 -2.487607 1.421447
N  0.788733 0.527924 0.067836
N  -2.551035 2.19554 0.404704
C  -0.568613 0.697059 0.254395
C  -1.193585 2.000675 0.22755
C  -1.419734 -0.43737 0.483609
C  -2.802463 -0.249054 0.664954
C  -0.346384 3.138242 -0.003051
C  1.534242 1.614997 -0.142166
C  1.01687 2.958279 -0.188302
C  -3.304017 1.102817 0.611192
C  -3.76552 -1.362412 0.946934
C  3.71652 0.373314 -0.347942
C  -6.136745 -1.986035 0.891517
C  5.080882 0.664814 -0.582177
C  3.272988 -0.955974 -0.15018
C  6.025461 -0.379382 -0.621269
C  4.226572 -1.999828 -0.190039
C  5.581067 -1.702811 -0.423433
C  -7.451401 -1.376434 0.418598
H  -0.812267 4.127227 -0.025374
H  1.70497 3.787735 -0.366555
H  -4.377677 1.257201 0.745847
H  -6.133203 -2.208394 1.974067
H  -5.875505 -2.912475 0.349354
H  5.386367 1.704327 -0.730643
H  2.218543 -1.16593 0.028507
H  7.082649 -0.166561 -0.801527
H  3.904416 -3.033951 -0.038787
H  -8.27599 -2.091009 0.59412
H  -7.678147 -0.445831 0.966451
H  -7.414923 -1.147229 -0.659906
