program: Gaussian 09
title: 000278349
version: EM64L-G09RevD.01
frameworkgroup: C1[X(C12H10N2O4)]
method: RPBEPBE
basis: SDD
operation: Freq
keyword: #p
keyword: freq=noraman
keyword: PBEPBE/SDD
title: #p freq=noraman PBEPBE/SDD
converged: YES YES NO NO
title: Mulliken charges:
elementType: O O O O N N C C C C C C C C C C C C H H H H H H H H H H
charge: -0.333027 -0.200641 -0.186587 -0.252805 0.008184 -0.362277 0.256120 0.443429 0.067922 0.293823 -0.456809 -0.356282 -0.324017 -0.424215 -0.244551 -0.237528 0.293152 -0.603694 0.246965 0.275302 0.286631 0.247991 0.236055 0.235076 0.347860 0.239722 0.234538 0.269661
chargesum: 0.00000
title: Mulliken charges with hydrogens summed into heavy atoms:
elementType: O O O O N N C C C C C C C C C C C C
charge: -0.333027 -0.200641 -0.186587 -0.252805 0.008184 -0.014416 0.256120 0.443429 0.067922 0.293823 -0.209844 -0.080979 -0.037385 -0.176224 -0.008495 -0.002451 0.293152 0.140227
polarizability: 2.63584731e+02 5.10926556e+00 1.71363214e+02 -4.62699839e+00 4.03624108e-01 7.80153849e+01
1716.lowfreq: -4.6100 0.0007 0.0008 0.0010 6.8071 11.1734 19.5051 27.1901 55.9151
frequency: 19.3058 27.1394 55.8984 73.7477 93.6842 102.7485 138.5562 163.1085 195.3522 197.5935 234.3933 262.5752 292.0670 327.4539 365.8198 385.8387 415.5018 461.1238 510.8985 522.8773 525.2717 583.7980 603.8842 632.6968 650.8119 661.4704 684.4934 710.2799 729.6230 742.3509 762.7404 784.1764 824.2893 836.7930 850.1515 880.0522 956.1891 959.5621 976.0895 996.3274 1012.1496 1036.2589 1065.6983 1126.5242 1144.2121 1150.7457 1164.6158 1178.4467 1184.4275 1219.7252 1236.5489 1245.4192 1279.4722 1333.3910 1368.7600 1408.1653 1412.3760 1430.7361 1433.8947 1454.8250 1467.1879 1482.2504 1509.5703 1518.1769 1574.4285 1600.1375 1633.3659 1722.2952 2987.7071 3068.9899 3118.3282 3129.2708 3142.0675 3143.9695 3163.1463 3181.5915 3201.1774 3568.9720
redmass: 6.4381 4.8441 5.8716 11.4251 4.7679 1.0814 4.1925 4.7104 5.2735 5.6176 5.1999 7.3939 7.6337 5.7039 6.5237 5.0091 4.4856 4.2452 4.7494 5.6649 4.5657 4.2636 1.1978 6.6480 5.7201 6.8745 8.9404 5.4131 5.6949 8.0356 1.3611 3.9098 1.6123 4.4672 4.2758 1.5735 1.4880 4.7151 1.4221 1.3485 5.0859 2.3399 5.2105 1.2869 1.7645 1.7109 1.3363 1.6703 1.4449 6.3546 1.7074 3.2201 1.9481 3.2697 4.8715 5.7761 4.1178 3.1552 1.1678 1.6656 1.6406 1.0465 2.6339 1.6438 8.1921 5.9539 6.8814 9.8855 1.0350 1.1028 1.0991 1.0871 1.0909 1.0904 1.0968 1.0968 1.0952 1.0775
irintensity: 1.2097 10.3644 3.6918 1.9705 0.6830 0.1881 1.1725 0.7095 1.8449 2.7263 4.1331 1.0329 3.5821 20.2193 3.4475 0.9404 2.3575 8.1700 8.6784 4.8080 0.6270 11.6042 107.7938 7.2923 7.8088 8.2323 33.0308 4.4877 2.7347 12.4051 38.6175 8.0579 61.2253 29.2886 63.3541 7.1781 8.0273 31.4872 3.4121 0.4530 18.9450 15.3843 432.3740 0.3370 8.0883 97.8078 6.0791 258.7825 128.6617 254.5663 2.8669 70.4023 46.8517 36.1943 113.6681 25.8874 9.2962 6.0740 26.6318 204.3140 15.7944 16.9606 173.0175 74.9456 9.2376 23.4869 20.7107 281.6816 73.9402 29.4630 4.2386 0.9187 1.7833 19.9971 23.4396 9.5625 0.5733 49.3385
temp: 298.150 k
press: 1.00000 atm
elementType: 8 8 8 8 7 7 6 6 6 6 6 6 6 6 6 6 6 6 1 1 1 1 1 1 1 1 1 1
symmnumber: 1
zpe: 534107.3 jmol-1
zpe.correction: 0.203431 hartree
zpe.thermalcorrener: 0.219305 hartree
zpe.thermalcorrenthalpy: 0.220249 hartree
zpe.thermalcorrgfe: 0.157952 hartree
zpe.sumelectzpe: -872.329041 hartree
zpe.sumelectthermal: -872.313167 hartree
zpe.sumelectthermalent: -872.312223 hartree
zpe.sumelectthermalfe: -872.374519 hartree
dipole: 0.2008 -2.1069 -0.7332
dipole: 2.2398
quadrupole: -68.8274 -107.1536 -108.7482
quadrupole: 8.9163 -5.9302 3.6945
quadrupole: 26.0824 -12.2439 -13.8385 8.9163 -5.9302 3.6945
hfenergy: -872.5324717 hartree
pointgroup: C01 [X(C12H10N2O4)]
dipole: 0.0733578 -0.8346839 -0.2728726 debye
polarizability: 263.7866325|3.9806801|171.2451883|-2.025122|-1.1178442|77.9315091 unknown
InChI: InChI=1S/C12H10N2O4/c1-13-12(15)18-10-7-6-8-4-2-3-5-9(8)11(10)14(16)17/h2-7,13H,1H3
charge 0 multiplicity 1
28 atoms
O  2.011078 -0.054671 -0.546076
O  -0.454444 2.795346 -0.751464
O  1.135879 2.194322 0.766385
O  3.102379 -1.769322 0.714906
N  0.163176 1.9132 -0.034047
N  4.205732 0.158613 -0.076379
C  -1.679577 0.179669 -0.013963
C  -2.035547 -1.226734 -0.046042
C  -0.280588 0.505715 -0.123058
C  0.699302 -0.487025 -0.297843
C  -1.010882 -2.214134 -0.21508
C  -2.722433 1.149008 0.162193
C  0.330164 -1.862934 -0.351091
C  -3.410257 -1.607086 0.093229
C  -4.05112 0.740823 0.303029
C  -4.404393 -0.643858 0.265764
C  3.139581 -0.67277 0.115913
C  5.548317 -0.164505 0.415953
H  -1.299239 -3.270775 -0.245425
H  -2.477657 2.213593 0.166465
H  1.109165 -2.614751 -0.486179
H  -3.664979 -2.672863 0.066663
H  -4.834792 1.494186 0.436355
H  -5.452553 -0.941572 0.373356
H  4.01721 1.059795 -0.517954
H  5.878586 0.566598 1.175867
H  6.279644 -0.179089 -0.412234
H  5.515346 -1.162578 0.879959
