program: Gaussian 09
title: 000278314
version: EM64L-G09RevD.01
frameworkgroup: C1[X(C12H9NO2)]
method: RPBEPBE
basis: SDD
operation: Freq
keyword: #p
keyword: freq=noraman
keyword: PBEPBE/SDD
title: #p freq=noraman PBEPBE/SDD
converged: NO NO NO NO
title: Mulliken charges:
elementType: O O N C C C C C C C C C C C C H H H H H H H H H
charge: -0.226476 -0.211479 0.015258 -0.112861 -0.084001 0.117850 0.447910 -0.395539 -0.060078 0.116894 -0.667254 -0.397138 -0.319107 -0.243598 -0.218806 0.255537 0.282216 0.244436 0.229264 0.236251 0.243969 0.270605 0.237368 0.238779
chargesum: 0.00000
title: Mulliken charges with hydrogens summed into heavy atoms:
elementType: O O N C C C C C C C C C C C C
charge: -0.226476 -0.211479 0.015258 0.142675 -0.084001 0.117850 0.447910 -0.113323 -0.060078 0.116894 0.042698 -0.153169 -0.048502 -0.006230 0.019973
polarizability: 2.22364755e+02 2.66501841e+00 1.49221760e+02 -3.47558851e+00 6.87971125e+00 6.43799228e+01
1716.lowfreq: -2.7882 -0.0011 -0.0010 -0.0004 3.3715 13.6546 78.0352 91.2189 123.5701
frequency: 78.0349 91.2187 123.5649 171.9864 202.0770 222.6707 233.6440 299.2358 339.2396 397.5194 410.0746 438.0168 477.7334 519.2530 547.3041 578.3267 603.3644 630.5686 645.4053 684.7493 720.0165 762.5229 772.3084 772.9768 807.0290 861.5150 885.1006 885.9495 944.1027 946.8317 977.1886 1001.8371 1009.2828 1018.3201 1063.7355 1092.1445 1112.9491 1136.4230 1170.1415 1198.6241 1223.9735 1254.5974 1269.4702 1307.2875 1308.1684 1377.0006 1386.9465 1394.6367 1418.0529 1457.3687 1465.0779 1474.3961 1509.8769 1565.9184 1616.9057 1622.7995 1693.3992 3000.6198 3026.3834 3105.0097 3112.4793 3128.4554 3142.2926 3145.7369 3160.1983 3173.7250
redmass: 3.7489 5.1001 5.7876 3.3607 1.2486 3.4003 5.9606 4.9020 5.3423 4.0443 4.9818 4.3628 2.9358 7.4292 3.7658 6.7878 7.1659 5.8196 6.7642 5.8398 5.6946 3.8078 1.3999 4.6795 3.1447 5.3592 1.5742 4.2320 4.3467 1.5232 1.4217 1.3403 2.4984 2.1748 1.6346 2.5162 2.3297 2.2001 1.1600 1.5768 1.9600 1.8209 1.8692 2.3739 1.7682 2.1958 1.5859 3.6847 3.3826 1.3986 1.6895 1.1354 4.2951 8.9653 8.1855 6.5431 12.9317 1.0347 1.0852 1.1002 1.1016 1.0876 1.0895 1.0936 1.0949 1.0997
irintensity: 4.1657 0.0601 0.1276 2.8801 0.3359 1.0126 7.5069 0.8282 4.5745 1.5474 3.3084 1.1196 11.6583 5.1773 1.9031 4.8261 3.5361 1.4073 2.0656 2.1083 4.6533 4.1239 77.2938 2.1025 12.7777 45.9753 4.8743 7.7994 66.4485 12.4631 11.2174 0.1205 85.0621 9.3442 36.7946 22.8625 16.2502 39.0558 9.5832 6.1251 7.3735 12.3715 17.3789 4.2222 5.5583 10.9152 17.6531 6.4566 2.4931 8.0297 4.7608 8.8972 32.2617 26.4236 80.2292 36.5283 413.1731 14.6440 9.2221 14.0095 23.7950 1.7305 7.4111 1.8329 17.5218 19.7261
temp: 298.150 k
press: 1.00000 atm
elementType: 8 8 7 6 6 6 6 6 6 6 6 6 6 6 6 1 1 1 1 1 1 1 1 1
symmnumber: 1
zpe: 473564.3 jmol-1
zpe.correction: 0.180371 hartree
zpe.thermalcorrener: 0.191797 hartree
zpe.thermalcorrenthalpy: 0.192741 hartree
zpe.thermalcorrgfe: 0.142963 hartree
zpe.sumelectzpe: -666.859252 hartree
zpe.sumelectthermal: -666.847827 hartree
zpe.sumelectthermalent: -666.846882 hartree
zpe.sumelectthermalfe: -666.896660 hartree
dipole: -4.9931 -1.9886 0.2422
dipole: 5.3799
quadrupole: -85.9482 -85.9768 -87.2631
quadrupole: -14.5616 -0.6656 0.5973
quadrupole: 0.4478 0.4192 -0.8671 -14.5616 -0.6656 0.5973
hfenergy: -667.0396231 hartree
pointgroup: C01 [X(C12H9N1O2)]
dipole: 1.9823366 -0.7352994 -0.0989034 debye
dipolederiv: -0.6956223 -0.3046186 0.0368772 -0.2070978 -1.1334475 -0.0115865 0.0228941 0.0378169 -0.3149714 -0.8007734 0.3111446 -0.0090021 0.4017536 -1.0987741 0.0245841 -0.0210696 0.0726654 -0.3250301 -0.6171134 -0.0465559 -0.0042771 0.0651044 -0.2649862 0.0091163 0.0025805 0.0072455 -0.2327101 0.161918 -0.2311133 -0.001857 -0.0446354 0.538508 0.0319756 -0.0161101 0.0277229 0.3347659 0.4139559 0.1315301 0.0099486 0.1122771 0.2438279 -0.0391761 -0.070269 -0.0569063 -0.0130052 -0.8883876 0.0825543 0.0114108 -0.1176638 -0.3036597 0.0295921 0.0724787 0.0372275 0.0488261 -0.1953853 0.0530293 -0.0005815 0.2932718 -0.2490858 0.0242346 -0.0172575 0.0313575 0.058712 0.4698834 -0.051511 -0.0141338 0.0325481 0.1922136 -0.03572 -0.0295009 -0.0230119 -0.0783388 0.4407613 0.1171894 -0.0189986 -0.279944 0.0541848 0.0106893 0.0127073 -0.0047634 0.073455 1.7044209 -0.0323025 -0.0223454 -0.3910021 1.7485386 -0.0866692 -0.0208031 -0.158199 0.251026 -0.0175744 0.0134166 -0.038091 0.0463679 -0.0511717 -0.0698087 0.0541946 -0.0460697 -0.0140045 0.0235946 -0.056216 -0.001641 0.0877976 0.1258244 -0.0316896 -0.0164861 -0.027802 -0.1529376 -0.2657428 -0.0432019 0.0038596 -0.0305071 0.1206013 -0.0332731 0.0073385 -0.0257544 -0.1557656 0.0252155 0.15169 -0.0250432 0.1746512 -0.0436896 -0.0186982 -0.0253156 -0.0169062 -0.1434708 0.0823141 -0.0970613 0.0021403 -0.1126689 0.0851898 -0.0180414 0.0030457 -0.0197875 -0.134389 0.0117647 0.0282851 0.0237724 -0.0036684 -0.0031589 0.0367479 0.0153307 0.0542911 -0.0705254 0.091562 -0.0187195 0.0028536 -0.0049857 -0.0141333 0.0155878 0.0012571 0.0170406 0.142072 -0.1291119 -0.1047989 0.0079721 -0.0889543 0.0742997 -0.0127279 0.0092747 -0.0172909 0.0802827 0.1048659 -0.0292054 0.0316639 -0.0011782 0.0448015 0.1013513 0.0145529 0.0413541 -0.076954 0.0580648 0.1156206 -0.0166075 0.0756993 -0.0334214 0.0017982 -0.0249074 -0.0000721 0.0916345 0.0733619 0.0355098 -0.0004605 -0.0406325 -0.0844626 0.0266274 0.0076895 0.0243592 0.1556177 0.0954014 -0.0312497 0.0065512 0.0293623 -0.0382252 0.0208032 -0.0001776 0.0214594 0.1585904 -0.0787164 -0.0828125 0.0176501 -0.0871508 0.0484126 0.0154113 0.019017 0.0153806 0.159777 -0.0686569 0.0893965 -0.0016612 0.0912559 0.0418138 0.0088716 -0.0004643 0.0086424 0.1573431 unknown
polarizability: 222.474316|-0.9016397|149.3442726|-2.6524998|-5.5605911|64.1478495 unknown
InChI: InChI=1S/C12H9NO2/c1-7-11-9(12(14)15-7)6-8-4-2-3-5-10(8)13-11/h2-7H,1H3
charge 0 multiplicity 1
24 atoms
O  -3.258307 -0.025071 0.209912
O  -2.973492 2.2885 -0.046002
N  0.151375 -1.407156 0.22657
C  -2.382333 -1.247457 0.305132
C  -0.973864 -0.685881 0.194782
C  -1.045685 0.73235 0.043463
C  1.365509 0.770833 -0.055402
C  0.1213 1.481034 -0.0817
C  1.338116 -0.680012 0.100727
C  -2.467747 1.156585 0.053391
C  -2.763145 -2.245729 -0.793987
C  2.630569 1.43306 -0.175947
C  2.572638 -1.398677 0.128156
C  3.819912 0.702048 -0.145586
C  3.789605 -0.721151 0.007363
H  -2.562701 -1.678105 1.307259
H  0.091104 2.57029 -0.196853
H  -3.813137 -2.560302 -0.676812
H  -2.636159 -1.795042 -1.792851
H  -2.108422 -3.131622 -0.718479
H  2.649965 2.523081 -0.292536
H  2.524662 -2.485263 0.246213
H  4.783072 1.214793 -0.238787
H  4.731065 -1.280605 0.029575
