program: Gaussian 09
title: 000278310
version: EM64L-G09RevD.01
frameworkgroup: C1[X(C11H8N2O2)]
method: RPBEPBE
basis: SDD
operation: Freq
keyword: #p
keyword: freq=noraman
keyword: PBEPBE/SDD
title: #p freq=noraman PBEPBE/SDD
converged: NO YES NO NO
title: Mulliken charges:
elementType: O O N N C C C C C C C C C C C H H H H H H H H
charge: -0.301543 -0.233920 0.003034 0.003472 0.211073 0.390779 -0.245540 0.171780 -0.250806 -0.411210 -0.180337 -0.448563 -0.177548 -0.314221 -0.326008 0.278600 0.310914 0.279365 0.241361 0.264776 0.235379 0.251325 0.247837
chargesum: 0.00000
title: Mulliken charges with hydrogens summed into heavy atoms:
elementType: O O N N C C C C C C C C C C C
charge: -0.301543 -0.233920 0.003034 0.003472 0.211073 0.390779 0.033060 0.171780 0.060108 -0.131844 0.061024 -0.183788 0.057831 -0.062895 -0.078171
polarizability: 2.30698401e+02 -1.49841763e+00 1.36522165e+02 -2.95111679e-01 3.54022866e-01 5.28766167e+01
1716.lowfreq: -10.4635 -8.2422 -3.3518 -0.0004 0.0001 0.0009 19.2041 40.6100 68.8235
frequency: 18.8825 40.5704 68.7955 83.3188 157.8087 208.1080 241.6090 275.4618 328.9142 370.6063 404.4392 426.9897 450.9787 500.4478 567.2318 609.2877 616.6008 687.4839 695.3010 713.3606 716.6566 768.2413 814.8810 816.8163 832.4119 913.3430 939.6754 941.5191 968.2265 987.9985 992.5975 997.3162 1006.0983 1016.2702 1027.8668 1052.8793 1108.6309 1113.6018 1175.3625 1196.9928 1200.2003 1244.0691 1312.1917 1314.6916 1324.5705 1328.3059 1408.9884 1414.8848 1445.9425 1454.2163 1549.3567 1554.2432 1569.1553 1584.6404 1624.7859 3138.3393 3141.0174 3144.2669 3156.6752 3165.9986 3167.7719 3177.3699 3213.6617
redmass: 4.8109 5.4817 8.5184 6.2246 4.5323 6.4475 4.5249 5.6396 8.6237 2.8788 3.2977 4.7798 8.5502 4.2325 8.7173 8.0197 7.5345 7.3547 8.2893 2.2123 1.8495 9.5064 2.8453 2.3097 1.7042 1.3965 1.3826 1.4428 1.5005 5.3099 1.3579 3.9981 1.3852 5.0258 3.0244 2.7380 1.6019 1.5561 3.5223 1.3289 1.3129 3.2528 9.3447 3.4470 1.6661 1.2779 2.1470 2.2128 2.0058 2.1354 5.8524 6.0637 6.1310 5.9424 11.7442 1.0891 1.0876 1.0926 1.0914 1.0974 1.0927 1.1003 1.0957
irintensity: 0.7930 2.2374 2.5718 0.2465 0.7144 5.2105 0.5578 5.3777 7.0247 0.3765 3.2575 1.2223 2.0173 0.3789 0.5686 4.2412 6.0254 5.9601 7.3814 13.6299 74.4072 4.1815 26.5684 34.3114 26.6949 4.5817 0.7078 4.7152 2.1337 72.7384 2.7693 43.0685 0.6846 29.3386 0.4684 227.0226 41.6545 14.7869 333.7252 2.6993 32.0045 313.5320 0.8768 13.2847 23.3298 2.0043 31.6614 39.6401 75.3700 13.3695 0.4781 28.1496 8.9080 30.1765 179.4657 10.1679 11.6543 7.8752 6.3304 24.8481 6.8861 14.9284 4.1126
temp: 298.150 k
press: 1.00000 atm
elementType: 8 8 7 7 6 6 6 6 6 6 6 6 6 6 6 1 1 1 1 1 1 1 1
symmnumber: 1
zpe: 439561.4 jmol-1
zpe.correction: 0.167420 hartree
zpe.thermalcorrener: 0.179369 hartree
zpe.thermalcorrenthalpy: 0.180314 hartree
zpe.thermalcorrgfe: 0.126861 hartree
zpe.sumelectzpe: -682.863803 hartree
zpe.sumelectthermal: -682.851854 hartree
zpe.sumelectthermalent: -682.850909 hartree
zpe.sumelectthermalfe: -682.904362 hartree
dipole: 1.5749 2.9422 0.0943
dipole: 3.3385
quadrupole: -71.8991 -92.2470 -88.8886
quadrupole: -1.6312 -0.8415 0.3285
quadrupole: 12.4458 -7.9021 -4.5437 -1.6312 -0.8415 0.3285
hfenergy: -683.0312229 hartree
pointgroup: C01 [X(C11H8N2O2)]
dipole: -0.6049589 -0.8847169 0.7592728 debye
dipolederiv: -2.2526749 -0.3519574 0.1515683 -0.7379598 -0.4450063 0.1739655 0.4823351 0.2003192 -0.3049533 -0.780571 0.1431658 -0.1433008 -0.1704763 -0.6774668 0.2834106 0.1125528 0.3067646 -0.5461494 -0.5745493 -0.0431366 0.0128107 -0.0406981 -0.2722254 0.0153676 0.0089151 0.0148746 -0.2603038 -0.3186084 -0.0233119 0.0159549 -0.0172287 -0.2603442 0.0157622 0.0038575 0.0141106 -0.2563373 -0.6798952 0.0915769 -0.1177795 0.0135056 -0.128749 0.1149211 -0.0553273 0.1204971 -0.0844811 1.4801408 0.1287574 -0.0196331 0.103879 0.0443391 0.1052704 -0.0187533 0.1069546 0.0604642 0.2299396 -0.0926252 0.0935583 0.1289073 0.0310747 -0.0777846 -0.0848276 -0.0919005 -0.00863 2.3962906 0.0308842 0.1121778 0.7694855 0.9183096 -0.4757764 -0.502151 -0.5303531 0.6511786 -0.1794257 -0.0068137 0.0032072 0.0450426 -0.059483 -0.0555227 -0.0467564 -0.0537444 -0.0716352 0.2583426 0.0190276 0.0040719 -0.0382314 0.1186712 -0.1146841 0.05153 -0.1130764 0.067907 -0.1483829 0.1511821 -0.1237039 0.2876439 -0.131046 0.0380734 -0.2337505 0.0301318 -0.1446667 -0.0904327 0.0028298 -0.005851 -0.1407654 0.0739111 -0.1646497 0.137062 -0.1533631 0.060884 -0.135636 -0.0481831 0.0408405 -0.1804755 -0.0286445 -0.0862147 0.1676019 -0.0734615 -0.0251238 0.3454151 0.0132349 0.0154027 -0.1308026 0.1242189 -0.1475159 0.1301562 -0.1381618 0.0683183 0.2869449 -0.0208151 0.0462734 0.1263814 -0.0096865 -0.0629056 -0.0894764 -0.0746151 -0.0259385 0.1502156 0.0395078 -0.0314822 0.0135132 0.0630159 0.0686402 -0.0096155 0.0707456 0.0908904 0.1826425 -0.0377745 0.0362591 -0.0300732 0.1161528 0.0545767 0.033029 0.0500751 0.1295621 0.0449296 -0.052587 0.0365073 -0.0894354 0.0861542 0.0298486 0.0659359 0.0334757 0.1082002 -0.0377615 -0.07048 0.0433865 -0.0896536 0.0707118 0.0668759 0.0588209 0.0681954 0.1111831 0.0394161 0.0570935 -0.0599509 0.0792961 0.0834154 0.0645635 -0.080337 0.0617754 0.0817901 0.0132221 0.0485822 -0.0565805 0.0729205 0.057028 0.099236 -0.0793039 0.0966654 0.0613783 -0.1050751 0.0179893 -0.0299958 0.0375155 0.1061626 0.0268345 -0.0445114 0.0253989 0.1136725 -0.1244866 0.0038531 -0.0237409 -0.0122907 0.1194864 0.0277077 -0.0069861 0.0286918 0.1227902 unknown
polarizability: 230.2482017|5.7753376|101.3619221|7.1249573|-41.0745268|88.4870593 unknown
InChI: InChI=1S/C11H8N2O2/c14-11(9-3-1-5-12-7-9)15-10-4-2-6-13-8-10/h1-8H
charge 0 multiplicity 1
23 atoms
O  0.42543 0.271224 -0.14329
O  -0.16035 -1.521065 1.271663
N  -3.498789 1.146149 -1.084518
N  3.886487 1.249542 -0.823971
C  -1.885904 -0.243462 0.126792
C  1.83919 0.209022 -0.001322
C  -2.939434 -1.018557 0.678062
C  -0.488024 -0.592181 0.498413
C  2.564923 -0.65224 0.855267
C  -2.216543 0.826871 -0.747725
C  -4.267636 -0.698419 0.337047
C  2.53144 1.137746 -0.817606
C  3.973839 -0.532242 0.844818
C  -4.499036 0.38596 -0.542909
C  4.59165 0.41769 0.003285
H  -2.696421 -1.844686 1.353928
H  2.057311 -1.377487 1.49097
H  -1.429159 1.444305 -1.188717
H  -5.108633 -1.270382 0.739622
H  1.968792 1.804842 -1.47973
H  4.582038 -1.175332 1.488562
H  -5.517919 0.666887 -0.832667
H  5.68075 0.529916 -0.022176
