program: Gaussian 09
title: 000278333
version: EM64L-G09RevD.01
frameworkgroup: C1[X(C11H21FN2O)]
method: RPBEPBE
basis: SDD
operation: Freq
keyword: #p
keyword: freq=noraman
keyword: PBEPBE/SDD
title: #p freq=noraman PBEPBE/SDD
converged: YES YES NO NO
title: Mulliken charges:
elementType: F O N N C C C C C C C C C C C H H H H H H H H H H H H H H H H H H H H H
charge: -0.257908 -0.322454 -0.435110 -0.412888 0.057569 -0.024318 -0.478224 -0.459682 -0.472739 -0.437526 -0.399633 -0.713270 0.303013 -0.373429 -0.191671 0.188436 0.255915 0.219737 0.173532 0.197262 0.201023 0.203123 0.215231 0.243110 0.194352 0.192102 0.200526 0.285974 0.217797 0.210906 0.216219 0.296747 0.233132 0.255693 0.217300 0.200152
chargesum: 0.00000
title: Mulliken charges with hydrogens summed into heavy atoms:
elementType: F O N N C C C C C C C C C C C
charge: -0.257908 -0.322454 -0.149136 -0.116141 0.246005 0.231597 -0.084955 -0.061397 -0.054385 -0.000064 -0.007005 -0.068349 0.303013 0.115396 0.225781
polarizability: 1.68695352e+02 2.86030889e+00 1.24833223e+02 -5.40460561e+00 9.64213463e-02 1.11936726e+02
1716.lowfreq: -32.6732 -9.4887 -0.0009 -0.0006 0.0007 5.3631 18.9582 29.9706 37.6226
frequency: 15.3271 28.5750 37.4742 65.6773 67.4025 96.2697 107.4832 139.9874 173.9075 197.1900 218.5194 241.3155 263.1189 291.5907 323.1730 359.0137 364.1139 392.4851 420.9442 453.2000 461.1839 481.1001 510.1456 535.0998 645.0744 691.1622 713.7918 747.9940 777.2498 806.1892 822.5595 839.9980 882.4916 898.6868 909.4141 927.6895 946.9626 976.4377 1005.5970 1019.9057 1028.4063 1039.2101 1053.9306 1086.0126 1095.5490 1096.5381 1110.6981 1144.2104 1149.6000 1172.2868 1191.9464 1194.3244 1219.0832 1226.4737 1250.9286 1260.2079 1269.8848 1281.9183 1301.8197 1312.9498 1323.7951 1329.8534 1338.4963 1344.9039 1358.4222 1361.2975 1367.8148 1377.1408 1389.4519 1433.9212 1452.2227 1457.9988 1459.1002 1461.7509 1468.7763 1470.7652 1475.0525 1481.7865 1486.3436 1503.7112 1623.1767 2926.6647 2940.8680 2954.9283 2964.4751 2974.9649 2977.2194 2983.0087 2994.9638 3007.5138 3020.3279 3023.2759 3026.8281 3032.5261 3042.9907 3054.8686 3063.3015 3068.0703 3072.9931 3102.5093 3548.7437 3559.9561
redmass: 5.0198 3.9315 4.2351 4.3357 3.6595 2.5329 2.9963 2.9521 4.0289 1.6147 2.0049 2.0189 4.7462 1.8842 1.4590 1.9353 2.6048 2.6040 2.0686 2.8090 3.0370 2.3244 2.1657 1.4878 2.8980 3.6556 8.5352 1.4647 1.4780 1.8068 2.4622 3.7572 2.6019 2.2007 1.9917 1.5214 2.2876 1.8076 2.0537 2.0687 2.1445 2.4386 2.0455 1.7023 1.6237 1.7718 1.6228 2.3291 1.8901 1.9560 1.3998 1.4598 1.4410 1.4692 1.2401 1.2767 1.2600 1.2386 1.4527 1.5259 1.3950 1.5746 1.3847 1.5414 1.4789 1.2713 1.2960 1.3435 1.2124 1.1508 1.4272 1.0981 1.1078 1.0888 1.0826 1.0881 1.0829 1.1046 1.0620 2.1849 5.1430 1.0772 1.0715 1.0607 1.0623 1.0366 1.0646 1.0618 1.0621 1.1001 1.0573 1.0963 1.0885 1.0911 1.1018 1.0986 1.0992 1.0995 1.0992 1.1114 1.0772 1.0770
irintensity: 0.0706 1.6398 0.8525 16.2582 3.5641 3.3710 6.0377 8.4560 1.6632 0.1623 0.3384 0.4421 11.8579 1.8201 5.9552 23.8451 0.4590 3.0234 2.6543 1.6622 4.3305 3.9417 25.3168 190.0636 7.0231 0.2654 8.9164 3.7284 0.2251 6.0704 2.8595 29.7776 9.4406 7.5967 5.2014 3.7701 16.9266 34.8065 19.1217 17.4425 1.8596 2.4920 1.9683 0.3736 1.1174 1.4388 5.3982 8.3615 7.1060 2.3983 1.4820 4.6618 58.6294 38.5863 21.7501 117.3783 0.9929 6.4457 31.6800 4.0152 16.7834 6.4599 1.5301 1.8895 1.4032 7.3682 2.3766 1.4964 19.4173 41.8261 97.9875 7.4582 4.4120 4.9179 22.4294 7.8416 3.3458 32.0192 13.4734 594.6774 172.2772 1.1607 39.6320 6.0391 86.0263 31.9626 24.7284 28.4599 50.4692 9.6745 44.4976 69.6598 34.7335 51.2584 55.2799 38.4329 9.0206 57.0293 59.6886 43.8236 16.0273 17.6431
temp: 298.150 k
press: 1.00000 atm
elementType: 9 8 7 7 6 6 6 6 6 6 6 6 6 6 6 1 1 1 1 1 1 1 1 1 1 1 1 1 1 1 1 1 1 1 1 1
symmnumber: 1
zpe: 823319.4 jmol-1
zpe.correction: 0.313586 hartree
zpe.thermalcorrener: 0.330423 hartree
zpe.thermalcorrenthalpy: 0.331367 hartree
zpe.thermalcorrgfe: 0.266559 hartree
zpe.sumelectzpe: -715.151963 hartree
zpe.sumelectthermal: -715.135126 hartree
zpe.sumelectthermalent: -715.134182 hartree
zpe.sumelectthermalfe: -715.198990 hartree
dipole: -1.8404 -1.5482 0.0527
dipole: 2.4056
quadrupole: -88.9470 -100.8692 -91.0323
quadrupole: 1.9106 -3.4089 1.8203
quadrupole: 4.6692 -7.2530 2.5839 1.9106 -3.4089 1.8203
hfenergy: -715.465549 hartree
pointgroup: C01 [X(C11H21F1N2O1)]
dipole: -0.7319406 0.5993661 0.0274804 debye
polarizability: 168.501655|-2.9441025|124.5910372|6.3703699|1.4578499|112.3726095 unknown
InChI: InChI=1S/C11H21FN2O/c1-2-9-3-5-10(6-4-9)14-11(15)13-8-7-12/h9-10,13-14H,2-8H2,1H3
charge 0 multiplicity 1
36 atoms
F  4.970787 2.089532 0.110833
O  2.050754 -1.772028 0.004962
N  0.481331 -0.070892 -0.331869
N  2.592838 0.433982 0.582131
C  -3.228261 -0.043092 0.152211
C  -0.541727 -0.981404 -0.894481
C  -2.462358 0.74051 -0.94604
C  -2.225523 -0.826576 1.041114
C  -1.528241 -0.177559 -1.775026
C  -1.308006 -1.753698 0.2140
C  -4.13602 0.873211 1.012391
C  -5.28445 1.554755 0.23554
C  1.721253 -0.543515 0.078912
C  3.943939 0.077224 1.01258
C  5.021463 0.614145 0.075034
H  -3.87919 -0.787358 -0.360517
H  0.004928 -1.715583 -1.514426
H  -3.173231 1.241145 -1.630212
H  -1.881707 1.556862 -0.460732
H  -1.602955 -0.102949 1.608897
H  -2.779702 -1.420881 1.793979
H  -2.150959 -0.904479 -2.332483
H  -0.967426 0.410872 -2.526919
H  -0.574005 -2.268528 0.859869
H  -1.919145 -2.540342 -0.274457
H  -3.505888 1.647515 1.499095
H  -4.567522 0.266177 1.834453
H  0.226384 0.905636 -0.180271
H  -4.904495 2.250795 -0.534333
H  -5.918319 0.803547 -0.27301
H  -5.933323 2.136485 0.915843
H  2.367203 1.426867 0.510001
H  4.135189 0.451972 2.036636
H  3.990071 -1.027588 1.028625
H  4.841918 0.31803 -0.972887
H  6.036298 0.32691 0.404758
