program: Gaussian 09
title: 000278341
version: EM64L-G09RevD.01
frameworkgroup: C1[X(C11H16O4)]
method: RPBEPBE
basis: SDD
operation: Freq
keyword: #pfreq=noraman
keyword: PBEPBE/SDD
title: #p freq=noraman PBEPBE/SDD
converged: YES YES NO NO
title: Mulliken charges:
elementType: O O O O C C C C C C C C C C C H H H H H H H H H H H H H H H H
charge: -0.273176 -0.300394 -0.254013 -0.228458 0.288032 0.046602 -0.780546 -0.774675 0.176066 0.145642 -0.255856 -0.666270 0.483973 -0.773206 -0.675458 0.247100 0.223154 0.269650 0.224893 0.263482 0.247840 0.236188 0.220818 0.217399 0.227771 0.248309 0.225633 0.276391 0.241499 0.240044 0.231565
chargesum: 0.00000
title: Mulliken charges with hydrogens summed into heavy atoms:
elementType: O O O O C C C C C C C C C C C
charge: -0.273176 -0.300394 -0.254013 -0.228458 0.288032 0.046602 -0.040642 -0.038460 0.176066 0.145642 0.201150 0.027210 0.483973 -0.029683 -0.203849
polarizability: 1.58672945e+02 1.75540206e+01 1.52567397e+02 5.02949320e+00 2.56566688e+00 1.10398090e+02
1716.lowfreq: -9.6997 -6.2023 -5.0394 -0.0006 0.0004 0.0005 13.5263 34.7376 47.0203
frequency: 11.2139 34.7020 47.0096 55.8379 62.7428 70.0380 79.2450 112.9695 139.9320 141.9731 154.9715 181.5016 201.9830 213.8831 254.2945 318.6126 323.3725 336.9283 381.6474 399.0949 409.4556 442.7815 445.8242 477.1993 494.8054 528.7322 670.9971 692.8743 723.0007 743.2967 786.5070 793.0647 808.3529 822.0173 900.4974 912.2776 931.9554 953.8695 975.2507 991.4754 1006.1105 1018.5626 1058.2894 1072.8972 1081.0046 1095.4758 1154.6979 1179.4711 1200.7787 1228.2388 1271.4093 1277.7642 1354.0227 1389.6199 1389.8123 1391.7629 1399.5824 1407.3007 1445.5452 1449.9553 1454.6630 1455.9853 1460.1328 1461.7947 1467.5790 1478.2284 1485.0369 1607.9100 1622.8586 1631.4991 1683.4171 2977.5585 2982.7721 2992.5215 2992.7259 3028.8544 3050.9509 3055.7295 3081.3448 3087.7477 3092.5489 3109.3867 3118.2476 3124.6731 3125.3961 3130.6442 3238.5552
redmass: 3.7342 3.2872 3.3612 2.3907 3.6695 1.6116 3.1739 3.3672 1.2404 2.7514 2.0602 1.6092 2.5994 1.3375 3.1934 3.0072 3.3108 4.0390 3.8190 6.4153 2.6133 3.1081 3.9471 2.7905 2.8200 4.0175 3.2561 2.6928 2.6416 4.0567 3.5273 4.1003 1.8036 2.7962 2.3324 1.3721 2.2083 1.3396 1.3992 3.5249 1.4783 3.6104 1.5041 2.3952 1.7639 2.1367 1.6979 5.2654 4.7342 3.2588 4.4590 1.1555 1.2810 1.2200 1.1807 1.1850 1.1827 1.2345 1.0654 1.0474 1.1067 1.0749 1.0930 1.0448 1.0785 1.0588 1.0513 9.1505 7.6898 7.8999 5.8095 1.0404 1.0406 1.0366 1.0361 1.0590 1.0949 1.0947 1.0969 1.0976 1.1035 1.1001 1.1058 1.0975 1.0630 1.0970 1.1158
irintensity: 1.7129 0.1197 2.8745 2.2755 0.0995 2.7765 0.2475 0.1023 0.3000 0.6713 1.8445 0.7934 1.6771 3.5062 3.6699 9.1980 6.6970 4.6451 1.3570 0.2010 1.5176 1.7080 4.6083 5.1778 1.4955 14.4195 19.2960 1.3771 4.1992 7.8824 2.0459 3.2158 6.8228 1.9270 28.5107 92.1480 13.0582 0.9468 10.2640 82.8648 6.0527 152.6708 1.5912 379.6415 19.9216 15.8524 27.7194 337.4610 254.3286 36.6186 31.6326 3.3620 1.0180 26.7638 39.0764 36.8774 37.6645 12.4329 19.0419 21.9692 36.2286 10.7268 9.6545 16.3798 15.4426 24.9468 13.7245 300.0912 72.4068 166.7575 84.6360 2.2411 27.3416 11.1598 23.7976 28.5398 15.2182 18.9641 9.4331 34.4223 1.5846 19.0134 31.3803 9.8946 0.2046 5.5972 9.1328
temp: 298.150 k
press: 1.00000 atm
elementType: 8 8 8 8 6 6 6 6 6 6 6 6 6 6 6 1 1 1 1 1 1 1 1 1 1 1 1 1 1 1 1
symmnumber: 1
zpe: 651350.2 jmol-1
zpe.correction: 0.248086 hartree
zpe.thermalcorrener: 0.266303 hartree
zpe.thermalcorrenthalpy: 0.267247 hartree
zpe.thermalcorrgfe: 0.199140 hartree
zpe.sumelectzpe: -728.477433 hartree
zpe.sumelectthermal: -728.459216 hartree
zpe.sumelectthermalent: -728.458272 hartree
zpe.sumelectthermalfe: -728.526379 hartree
dipole: -0.5557 0.6788 -0.5547
dipole: 1.0379
quadrupole: -84.1691 -75.2308 -94.4601
quadrupole: 7.1582 5.2112 -4.2883
quadrupole: 0.4509 9.3892 -9.8401 7.1582 5.2112 -4.2883
hfenergy: -728.7255191 hartree
pointgroup: C01 [X(C11H16O4)]
dipole: 0.2536584 0.2519444 0.1973117 debye
polarizability: 150.1827196|-15.3886155|157.075983|10.1479109|-12.8779099|114.379729 unknown
InChI: InChI=1S/C11H16O4/c1-6-14-10(12)9(7(2)3)11(13)15-8(4)5/h4,6H2,1-3,5H3
charge 0 multiplicity 1
31 atoms
O  0.779342 1.427494 -0.132607
O  -1.616864 0.168969 -0.995769
O  2.200501 0.018576 -1.330722
O  -1.866281 -0.821256 1.114837
C  0.754227 -2.160536 0.24416
C  0.292686 -0.897753 -0.06621
C  2.199772 -2.581609 0.083213
C  -0.147951 -3.253793 0.780359
C  1.190995 0.172904 -0.598174
C  -1.143647 -0.526373 0.136253
C  1.562418 2.605709 -0.614903
C  2.77266 2.861797 0.287886
C  -2.878145 0.86856 -0.961488
C  -3.10636 1.772329 0.224439
C  -3.670282 0.729313 -2.04921
H  2.310297 -3.176583 -0.845142
H  2.490378 -3.240232 0.922778
H  2.898556 -1.737669 0.004024
H  0.156412 -4.229361 0.358568
H  -1.216167 -3.082129 0.585668
H  -0.029914 -3.325733 1.879682
H  1.871335 2.417498 -1.658069
H  0.835193 3.432781 -0.576756
H  3.283391 3.790508 -0.028055
H  2.460946 2.980062 1.340039
H  3.494647 2.031199 0.218755
H  -3.983171 2.414515 0.041931
H  -3.2734 1.186816 1.144268
H  -2.221252 2.413682 0.391799
H  -3.399096 0.054498 -2.865488
H  -4.600526 1.297113 -2.129962
