program: Gaussian 09
title: 000278330
version: EM64L-G09RevD.01
frameworkgroup: C1[X(C11H21ClN2O)]
method: RPBEPBE
basis: SDD
operation: Freq
keyword: #p
keyword: freq=noraman
keyword: PBEPBE/SDD
title: #p freq=noraman PBEPBE/SDD
converged: YES YES NO NO
title: Mulliken charges:
elementType: Cl O N N C C C C C C C C C C C H H H H H H H H H H H H H H H H H H H H H
charge: -0.091349 -0.321263 -0.434513 -0.404019 0.059210 -0.023758 -0.467551 -0.471259 -0.439688 -0.473634 -0.398580 -0.711578 0.304280 -0.340285 -0.546206 0.187981 0.254882 0.211875 0.196200 0.175305 0.208601 0.192907 0.246680 0.214958 0.204898 0.192896 0.195918 0.286868 0.220686 0.210037 0.214944 0.292207 0.265981 0.239765 0.263704 0.282900
chargesum: 0.00000
title: Mulliken charges with hydrogens summed into heavy atoms:
elementType: Cl O N N C C C C C C C C C C C
charge: -0.091349 -0.321263 -0.147645 -0.111812 0.247190 0.231125 -0.059476 -0.087354 -0.000101 -0.053777 -0.009765 -0.065911 0.304280 0.165461 0.000397
polarizability: 1.71910044e+02 6.18097167e-01 1.37045076e+02 3.67186006e+00 -4.58324406e+00 1.19012182e+02
1716.lowfreq: -8.1934 -6.1136 -0.0017 0.0012 0.0018 10.4177 20.0271 32.9407 38.1814
frequency: 13.6675 29.1198 38.1166 61.3438 79.2112 83.3515 102.0847 141.8237 181.9158 197.5610 227.4424 234.4039 244.7476 292.6665 331.8374 352.6841 371.1467 387.0911 420.4476 441.1412 467.7423 471.4497 500.5945 531.2239 592.4550 648.0031 697.6864 715.0152 749.7715 775.5872 809.5173 821.6988 861.1863 895.1983 913.2798 923.4749 940.5208 970.9769 978.9542 1002.8898 1016.9064 1041.7389 1043.9843 1057.6741 1092.3201 1100.1695 1110.3536 1137.1025 1149.8925 1159.1862 1183.7133 1193.8311 1216.2807 1229.2141 1241.3676 1257.9463 1271.2776 1286.9702 1298.4678 1306.1618 1315.9449 1325.8846 1333.3178 1341.4132 1347.7346 1363.5922 1365.6397 1373.0240 1391.2968 1429.9101 1439.7100 1450.7651 1459.3139 1463.2398 1467.8003 1470.0431 1475.5371 1479.7366 1488.9922 1502.1989 1622.9777 2927.5769 2940.1413 2954.1715 2962.6465 2975.6425 2977.3638 2981.7116 2996.1325 3004.5357 3016.1058 3026.6455 3036.4662 3041.6005 3054.2330 3056.7574 3063.9495 3068.5788 3078.4900 3152.5005 3541.3473 3550.0851
redmass: 5.2621 4.1517 6.3964 4.9680 3.0495 2.5621 2.9544 2.7657 3.5891 2.6377 1.7472 2.8394 2.1593 2.0697 1.4749 1.8009 2.5047 2.7599 2.1941 2.3908 2.7720 2.8224 2.5205 1.3994 4.1851 2.8633 3.8288 8.4533 1.4741 1.4994 1.8297 2.1383 2.4148 2.3086 1.8763 1.6329 2.1374 1.7836 2.4688 1.8899 1.5546 2.1612 2.0730 2.1526 1.5465 1.6145 1.5502 2.0691 1.9076 1.7826 1.9675 1.5061 1.3658 1.4565 1.3701 1.2404 1.2571 1.2517 1.2413 1.3186 1.5134 1.4272 1.5315 1.4502 1.4786 1.4129 1.3774 1.3247 1.2102 1.1506 1.1024 1.4116 1.0836 1.1245 1.0848 1.0884 1.1114 1.0806 1.0597 2.1702 5.1441 1.0768 1.0691 1.0609 1.0659 1.0643 1.0368 1.0627 1.0592 1.0992 1.0935 1.0864 1.0962 1.1014 1.0883 1.0974 1.0707 1.0992 1.0989 1.1118 1.0775 1.0768
irintensity: 0.9562 0.1623 0.5202 15.3636 2.7237 3.4513 4.3960 6.7806 0.6734 1.0130 1.0114 4.7445 1.7051 4.6574 6.3661 25.6687 1.4610 3.4543 2.7451 1.7548 9.2367 1.8033 7.4960 199.1123 30.6811 12.7942 6.2023 13.9334 3.3750 0.9890 2.7157 15.5258 8.2554 6.8908 6.1033 3.3155 17.9138 17.6064 8.1058 7.2904 1.0335 1.7048 1.3307 2.9490 0.6469 1.6660 2.7898 7.6894 8.0693 0.8518 7.4069 2.3048 46.2903 28.5106 141.2645 1.0465 8.3005 10.4988 12.8041 17.6031 38.8897 13.9617 4.8420 1.5638 0.2795 1.6787 3.9529 3.3844 14.8345 38.4686 15.7159 77.8636 5.6315 9.5707 7.1459 19.9731 7.8662 32.4446 14.1747 629.9264 166.9085 1.6050 29.6267 42.8857 49.3614 32.3608 34.1270 25.5408 48.3153 10.0193 81.1334 43.0415 39.0565 67.9925 7.6306 31.0825 21.6832 53.5258 57.0909 16.7384 18.0189 16.8458
temp: 298.150 k
press: 1.00000 atm
elementType: 17 8 7 7 6 6 6 6 6 6 6 6 6 6 6 1 1 1 1 1 1 1 1 1 1 1 1 1 1 1 1 1 1 1 1 1
symmnumber: 1
zpe: 820688.1 jmol-1
zpe.correction: 0.312584 hartree
zpe.thermalcorrener: 0.329579 hartree
zpe.thermalcorrenthalpy: 0.330523 hartree
zpe.thermalcorrgfe: 0.265049 hartree
zpe.sumelectzpe: -1075.377432 hartree
zpe.sumelectthermal: -1075.360436 hartree
zpe.sumelectthermalent: -1075.359492 hartree
zpe.sumelectthermalfe: -1075.424967 hartree
dipole: 1.7999 -1.7493 0.1466
dipole: 2.5142
quadrupole: -98.9764 -106.8984 -98.3737
quadrupole: -4.0515 6.2604 1.6025
quadrupole: 2.4398 -5.4822 3.0424 -4.0515 6.2604 1.6025
hfenergy: -1075.6900154 hartree
pointgroup: C01 [X(C11H21Cl1N2O1)]
dipole: -0.7389429 0.6449864 0.1279887 debye
polarizability: 171.7024777|2.6962415|136.1520705|-4.1103517|6.0632813|120.1127537 unknown
InChI: InChI=1S/C11H21ClN2O/c1-2-9-3-5-10(6-4-9)14-11(15)13-8-7-12/h9-10,13-14H,2-8H2,1H3
charge 0 multiplicity 1
36 atoms
Cl 5.321107 1.886339 0.407697
O  1.881168 -1.79868 -0.502556
N  0.527778 -0.137894 0.436921
N  2.583664 0.437908 -0.557255
C  -3.184157 0.260157 0.273458
C  -0.53036 -1.085493 0.857069
C  -2.315502 -0.363811 -0.850653
C  -2.282275 0.704976 1.454886
C  -1.430426 -1.519247 -0.330909
C  -1.384462 -0.444239 1.977307
C  -4.055602 1.441429 -0.225386
C  -5.130185 1.052829 -1.264862
C  1.670265 -0.574102 -0.220615
C  3.846669 0.107057 -1.212505
C  5.050899 0.126005 -0.268063
H  -3.86686 -0.533742 0.653645
H  -0.011124 -1.981222 1.24506
H  -2.958824 -0.736175 -1.67002
H  -1.672188 0.42813 -1.290578
H  -1.660575 1.567073 1.124393
H  -2.91019 1.087892 2.283374
H  -2.075973 -2.35292 0.014992
H  -0.788034 -1.920964 -1.134978
H  -0.727637 -0.089442 2.795266
H  -2.032263 -1.235457 2.403307
H  -3.391403 2.220765 -0.655455
H  -4.553682 1.908033 0.649837
H  0.352873 0.860954 0.554285
H  -4.678239 0.662904 -2.194769
H  -5.804139 0.271515 -0.864617
H  -5.751789 1.925344 -1.538107
H  2.484354 1.380044 -0.175292
H  3.735885 -0.922706 -1.603549
H  4.02935 0.787936 -2.064681
H  5.989786 -0.128177 -0.78279
H  4.895792 -0.503617 0.619545
