program: Gaussian 09
title: 000278321
version: EM64L-G09RevD.01
frameworkgroup: C1[X(C11H15N5O2)]
method: RPBEPBE
basis: SDD
operation: Freq
keyword: #p
keyword: freq=noraman
keyword: PBEPBE/SDD
title: #p freq=noraman PBEPBE/SDD
converged: YES YES NO NO
title: Mulliken charges:
elementType: O O N N N N N C C C C C C C C C C C H H H H H H H H H H H H H H H
charge: -0.428471 -0.434498 -0.204437 -0.087343 -0.058008 -0.062140 -0.609741 -0.051940 -0.096824 -0.503682 -0.161140 -0.471769 -0.402710 0.128818 -0.233476 -0.117068 0.169870 -0.370169 0.231037 0.214416 0.227851 0.253530 0.262968 0.258303 0.225020 0.197175 0.254566 0.345096 0.271001 0.329716 0.245352 0.333641 0.345056
chargesum: 0.00000
title: Mulliken charges with hydrogens summed into heavy atoms:
elementType: O O N N N N N C C C C C C C C C C C
charge: -0.083375 -0.104782 -0.204437 -0.087343 -0.058008 -0.062140 0.068956 0.179098 0.117592 -0.022301 0.101828 0.011554 0.049031 0.128818 0.037525 -0.117068 0.169870 -0.124817
polarizability: 2.09390611e+02 5.15146820e+00 1.59175031e+02 4.48536591e+00 1.19492700e+01 1.01543588e+02
1716.lowfreq: -8.2122 -0.0008 -0.0007 -0.0006 1.4984 11.8375 22.8623 34.8761 59.5038
frequency: 21.9565 34.5184 59.4822 92.2648 123.3011 136.2695 145.8319 195.9239 222.9184 232.5674 261.5322 286.8710 291.6706 311.1226 325.6960 370.0387 378.0164 429.6603 485.2562 508.4572 515.9251 519.1695 547.8151 557.6630 570.9390 591.0247 644.0502 655.4332 671.8558 700.7262 751.2765 792.4046 820.7599 823.0387 852.6136 877.8982 887.8939 928.8916 944.3829 959.5716 964.3648 976.8952 1009.5207 1026.8921 1031.7085 1048.9086 1084.7648 1105.8301 1116.8755 1148.8889 1179.5000 1183.3848 1204.7442 1227.0756 1241.4813 1248.6945 1262.7614 1278.8062 1280.1859 1296.2172 1303.0330 1308.6591 1316.5888 1325.4910 1345.1334 1360.5749 1375.1275 1377.6541 1389.8758 1395.0146 1437.6329 1462.4057 1468.1609 1475.7184 1478.2836 1538.9419 1578.2606 1631.6818 2951.5507 2987.4374 2999.4713 3012.0290 3016.2191 3024.3850 3073.8164 3079.1472 3090.7664 3164.6576 3228.8258 3539.2638 3553.0665 3566.5843 3694.5916
redmass: 5.6689 5.9358 4.8663 4.4282 5.0412 2.4554 4.6473 6.2905 3.2032 4.0761 4.3513 1.2688 2.9143 1.3406 3.3556 3.5518 2.2426 4.3200 2.9736 7.3015 1.2337 4.1792 1.0544 3.9758 4.2047 4.9731 4.5201 3.7005 7.6834 7.0769 3.4262 3.9731 2.9863 1.8267 5.1907 3.4855 1.6703 1.4279 1.8761 2.4770 3.1563 2.2428 3.6390 3.5827 2.7790 1.9577 1.9896 3.0639 1.1791 2.4265 1.9586 1.4613 1.6127 2.2164 1.5579 1.6114 1.9126 1.2985 1.2664 4.7362 1.5024 1.4440 4.5052 1.4310 1.4144 2.3034 1.2362 2.9103 1.7074 1.4615 2.7886 4.0761 1.0913 1.0878 1.0873 6.4182 1.9130 2.7236 1.0691 1.0811 1.0842 1.0662 1.0665 1.0838 1.1027 1.0976 1.1004 1.0921 1.0983 1.0442 1.0661 1.0663 1.1056
irintensity: 0.1216 0.7401 0.7668 4.5415 6.7880 2.8655 4.0599 1.1273 4.1206 5.2268 8.7007 98.7194 40.0096 99.7750 27.3844 23.9068 17.5110 13.6106 9.3212 2.8108 266.2293 13.2047 0.0061 1.8795 1.1112 2.8098 41.4366 3.8985 1.4927 2.7750 14.6374 17.8652 15.9239 5.6868 1.6729 14.2383 10.9224 11.2105 19.2998 3.6695 97.1308 14.6123 59.1159 58.6047 10.3014 22.0725 23.1832 2.9451 7.8836 31.2448 25.0909 9.3695 13.0464 54.4640 8.9460 10.2320 9.1328 2.9452 18.5256 51.3437 10.6514 17.0546 39.3105 20.5778 4.9375 77.8833 8.4450 5.2768 6.8344 14.5472 58.6272 19.9995 19.0132 8.4839 0.4436 55.1577 31.8587 631.5152 57.0639 31.8141 2.8200 29.3064 24.8585 28.9265 13.2640 29.5560 12.9963 13.8494 0.0157 131.3672 4.9881 6.2583 49.9125
temp: 298.150 k
press: 1.00000 atm
elementType: 8 8 7 7 7 7 7 6 6 6 6 6 6 6 6 6 6 6 1 1 1 1 1 1 1 1 1 1 1 1 1 1 1
symmnumber: 1
zpe: 693799.6 jmol-1
zpe.correction: 0.264254 hartree
zpe.thermalcorrener: 0.280434 hartree
zpe.thermalcorrenthalpy: 0.281378 hartree
zpe.thermalcorrgfe: 0.219742 hartree
zpe.sumelectzpe: -851.033296 hartree
zpe.sumelectthermal: -851.017116 hartree
zpe.sumelectthermalent: -851.016172 hartree
zpe.sumelectthermalfe: -851.077808 hartree
dipole: 0.6527 -1.8013 -2.6160
dipole: 3.2426
quadrupole: -91.5468 -113.3965 -106.2707
quadrupole: 0.6394 13.0674 -0.9926
quadrupole: 12.1912 -9.6585 -2.5327 0.6394 13.0674 -0.9926
hfenergy: -851.2975499 hartree
pointgroup: C01 [X(C11H15N5O2)]
dipole: 0.2206168 0.8246439 0.9480425 debye
polarizability: 209.5453587|-5.7337548|161.1429991|0.1894056|4.7140224|99.4208721 unknown
InChI: InChI=1S/C11H15N5O2/c12-10-9-11(14-4-13-10)16(5-15-9)7-1-6(3-17)2-8(7)18/h4-8,17-18H,1-3,12H2
charge 0 multiplicity 1
33 atoms
O  -1.702369 1.937614 -2.092861
O  -4.35719 -2.134691 -0.176859
N  0.305218 1.140856 0.299362
N  2.529363 1.724898 0.423812
N  0.563489 -1.316655 -0.064506
N  2.930963 -1.991418 -0.118345
N  4.711318 -0.459648 0.145594
C  -1.162143 1.289644 0.275624
C  -3.223522 -0.059175 0.668993
C  -1.911664 0.457929 1.359861
C  -1.803805 0.879612 -1.084071
C  -3.275466 0.654828 -0.711494
C  -3.180713 -1.598972 0.525487
C  1.032969 -0.046331 0.136677
C  1.256324 2.161574 0.46433
C  2.400086 0.338645 0.219521
C  3.366143 -0.702109 0.083142
C  1.583129 -2.220802 -0.180592
H  -1.368139 2.369334 0.405596
H  -4.114978 0.207458 1.270749
H  -2.124424 1.075463 2.249186
H  -1.287174 -0.391892 1.688139
H  -1.335043 -0.058474 -1.442227
H  -3.817565 0.057703 -1.462534
H  -3.768236 1.643001 -0.636947
H  -3.074303 -2.064021 1.529629
H  -2.317272 -1.908322 -0.086846
H  -0.797871 1.921963 -2.495553
H  0.9574 3.197738 0.61116
H  -5.167341 -1.936092 0.35814
H  1.287284 -3.261458 -0.343914
H  5.358709 -1.238313 0.042168
H  5.048921 0.488914 0.294578
