program: Gaussian 09
title: 000278300
version: EM64L-G09RevD.01
frameworkgroup: C1[X(C15H13NO3)]
method: RPBEPBE
basis: SDD
operation: Freq
keyword: #p
keyword: freq=noraman
keyword: PBEPBE/SDD
title: #p freq=noraman PBEPBE/SDD
converged: YES YES NO NO
title: Mulliken charges:
elementType: O O O N C C C C C C C C C C C C C C C H H H H H H H H H H H H H
charge: -0.265269 -0.258666 -0.264154 -0.077585 0.218904 0.171524 0.495713 -0.498156 -0.336466 -0.380699 -0.202876 -0.390829 0.240915 -0.376064 -0.311382 0.319883 -0.331899 -0.353075 -0.537803 0.297362 0.252546 0.231402 0.238987 0.239386 0.209953 0.251591 0.236222 0.241511 0.249045 0.222039 0.245317 0.222622
chargesum: 0.00000
title: Mulliken charges with hydrogens summed into heavy atoms:
elementType: O O O N C C C C C C C C C C C C C C C
charge: -0.265269 -0.258666 -0.264154 -0.077585 0.218904 0.171524 0.495713 -0.200794 -0.083920 -0.149297 0.275497 -0.180875 0.240915 -0.124473 -0.075160 0.319883 -0.090387 -0.104030 0.152175
polarizability: 4.35608275e+02 9.44975386e+00 1.68961865e+02 -1.26129618e+00 2.99503941e+00 8.38799655e+01
1716.lowfreq: -34.7392 -2.9433 -0.0008 0.0003 0.0005 4.2949 5.7729 26.5135 33.4661
frequency: -34.7169 26.4168 33.4537 48.3067 79.6310 117.9313 139.5933 182.4155 201.2346 210.9832 220.1514 245.5667 282.0349 344.7303 387.6028 398.1024 409.4705 420.0645 434.6111 490.7767 502.5447 527.7518 564.3736 607.7652 611.0432 633.7101 680.3912 720.2335 726.5655 732.1135 766.2340 787.8776 808.7185 811.0396 829.4232 841.2324 843.4965 909.1220 930.5985 933.4263 944.5086 954.6586 970.7993 978.6899 987.2421 994.9604 1057.2114 1065.9396 1109.3852 1111.6960 1119.9210 1126.0453 1156.5779 1159.0072 1175.7250 1200.5132 1231.4657 1257.0169 1264.4030 1297.4932 1344.2232 1363.8019 1370.5243 1405.2726 1427.1122 1436.6732 1454.6798 1466.2101 1470.9860 1474.3285 1487.0064 1495.2699 1565.1643 1574.8053 1606.1100 1622.2578 1625.8201 2947.0417 2959.6693 3014.8512 3047.7564 3093.1390 3125.3942 3133.2212 3136.0236 3148.9737 3164.2648 3170.8482 3182.2581 3186.4225
redmass: 2.3346 4.1912 5.6429 5.3772 4.5573 4.6193 6.6811 2.9457 3.6907 3.3761 2.8006 2.0119 4.9760 4.5021 5.4822 5.0610 6.1677 3.0948 3.2356 5.5454 4.6977 2.4788 5.9507 5.9965 4.4929 6.7629 9.6601 4.3417 5.3910 4.1372 6.6236 5.3131 1.2697 1.3404 2.1933 4.8507 5.8727 1.3656 1.3533 3.1221 1.4536 1.3630 1.7010 4.5264 6.7412 2.6343 3.7377 1.4564 1.3207 1.2614 1.0369 1.5817 1.3244 1.5316 1.5610 2.3439 3.5333 1.4214 3.2363 1.3169 2.4191 1.7113 2.2405 2.8287 3.8853 1.2089 4.4172 1.0501 1.1251 2.5408 1.2192 2.6374 7.2269 6.3685 7.5742 8.0248 6.6852 1.0855 1.0330 1.0534 1.1040 1.1189 1.0994 1.0881 1.0898 1.0875 1.0955 1.0964 1.0951 1.0936
irintensity: 15.3471 0.9968 0.9766 0.2540 2.7707 2.0380 2.0053 8.1864 5.8584 4.1328 1.8106 4.1061 1.1221 3.5066 1.4204 6.8497 11.9270 3.3006 4.1157 14.8283 33.4110 15.2317 1.0681 3.8411 16.0486 1.4639 0.2583 6.9647 14.8806 4.9274 21.9936 5.8959 1.3074 24.1079 72.7967 49.9344 11.4177 14.1482 8.8449 12.1476 2.9845 1.7437 26.3964 167.6419 50.6971 20.0125 21.9480 4.3658 14.7038 0.5168 0.0047 25.4048 8.3438 16.5643 27.9327 237.7166 165.9272 47.2585 325.9186 10.8117 22.6101 3.5358 36.8436 19.3203 0.7318 26.2060 213.4524 13.6377 49.6166 68.4227 16.6228 162.5369 45.3189 7.8474 14.8715 4.9995 143.8828 62.2765 98.7067 156.4367 48.7754 31.8417 29.9724 8.0622 8.7901 10.4972 12.6225 12.9416 6.0537 6.5197
temp: 298.150 k
press: 1.00000 atm
elementType: 8 8 8 7 6 6 6 6 6 6 6 6 6 6 6 6 6 6 6 1 1 1 1 1 1 1 1 1 1 1 1 1
symmnumber: 1
zpe: 640624.8 jmol-1
zpe.correction: 0.244001 hartree
zpe.thermalcorrener: 0.259603 hartree
zpe.thermalcorrenthalpy: 0.260547 hartree
zpe.thermalcorrgfe: 0.199362 hartree
zpe.sumelectzpe: -858.421258 hartree
zpe.sumelectthermal: -858.405656 hartree
zpe.sumelectthermalent: -858.404712 hartree
zpe.sumelectthermalfe: -858.465897 hartree
dipole: -0.3066 -0.3285 -0.5918
dipole: 0.7431
quadrupole: -80.2663 -100.3641 -113.7884
quadrupole: 6.3061 3.9584 1.7640
quadrupole: 17.8733 -2.2245 -15.6488 6.3061 3.9584 1.7640
hfenergy: -858.6652589 hartree
pointgroup: C01 [X(C15H13N1O3)]
dipole: -0.1166447 -0.053174 0.2627383 debye
polarizability: 435.6035759|-2.6467978|130.489806|-9.5561829|42.3813777|122.3567226 unknown
InChI: InChI=1S/C15H13NO3/c1-17-13-5-3-12(4-6-13)16-9-11-2-7-14-15(8-11)19-10-18-14/h2-9H,10H2,1H3
charge 0 multiplicity 1
32 atoms
O  4.448648 1.589133 0.96796
O  5.834384 -0.088882 -0.050803
O  -6.24158 -0.251571 -0.142385
N  -0.595669 0.068243 0.194663
C  3.64682 0.574421 0.384065
C  4.469191 -0.411587 -0.214665
C  1.68235 -0.636741 -0.294618
C  2.26042 0.497475 0.364034
C  3.931202 -1.52599 -0.863588
C  2.516067 -1.622576 -0.893266
C  5.855527 1.191257 0.713426
C  0.223107 -0.795898 -0.359401
C  -2.005278 -0.048087 0.080754
C  -2.787069 0.575104 1.088396
C  -2.685537 -0.699265 -0.99537
C  -4.850059 -0.143782 -0.000509
C  -4.195408 0.521462 1.067234
C  -4.08712 -0.743254 -1.036519
C  -7.07689 0.370306 0.887763
H  1.608664 1.246855 0.818643
H  4.572523 -2.282009 -1.322649
H  2.051417 -2.482089 -1.390331
H  6.364653 1.020892 1.677631
H  6.345711 1.964635 0.097659
H  -0.13243 -1.707129 -0.88624
H  -2.260505 1.094331 1.89555
H  -2.114519 -1.141186 -1.82006
H  -4.763541 1.002048 1.86912
H  -4.618652 -1.223444 -1.863965
H  -6.887224 -0.075784 1.883513
H  -8.112724 0.164484 0.580703
H  -6.911479 1.464325 0.933554
