program: Gaussian 09
title: 000278329
version: EM64L-G09RevD.01
frameworkgroup: C1[X(C13H21ClN2O)]
method: RPBEPBE
basis: SDD
operation: Freq
keyword: #p
keyword: freq=noraman
keyword: PBEPBE/SDD
title: #p freq=noraman PBEPBE/SDD
converged: NO YES NO NO
title: Mulliken charges:
elementType: Cl O N N C C C C C C C C C C C C C H H H H H H H H H H H H H H H H H H H H H
charge: -0.091110 -0.318644 -0.447801 -0.405153 -0.128324 -0.156962 -0.085356 -0.076679 -0.041756 -0.471505 -0.482891 -0.469297 -0.486663 -0.465063 0.282509 -0.337649 -0.547405 0.238972 0.216538 0.197854 0.197633 0.260722 0.196419 0.208612 0.199552 0.201449 0.207849 0.196471 0.207002 0.180139 0.197232 0.198444 0.281294 0.291732 0.239759 0.267047 0.281117 0.263912
chargesum: 0.00000
title: Mulliken charges with hydrogens summed into heavy atoms:
elementType: Cl O N N C C C C C C C C C C C C C
charge: -0.091110 -0.318644 -0.166507 -0.113421 0.110648 0.059575 0.112498 0.120955 0.218966 -0.066474 -0.081889 -0.064978 -0.099521 -0.069387 0.282509 0.169157 -0.002376
polarizability: 1.90822124e+02 -1.35610697e+00 1.49580968e+02 -4.72904981e+00 4.14467415e+00 1.26866737e+02
1716.lowfreq: -29.0295 -13.4382 -3.8018 -0.0017 0.0010 0.0013 16.3870 36.1500 45.6914
frequency: 15.8421 28.5445 36.1184 60.0023 77.1093 101.4111 183.1147 233.3352 236.6304 266.5455 301.1678 321.5749 347.8880 364.9471 372.6254 419.7184 424.3332 433.6338 445.1294 462.4572 533.3933 564.9168 591.6678 628.2302 635.1291 663.8054 687.9233 709.9168 756.2974 789.0212 800.9501 813.1251 848.6992 867.8655 869.8897 901.1883 914.9168 927.7646 955.6943 961.8389 978.6985 986.3952 1015.5564 1036.4275 1038.0477 1044.5251 1067.2392 1071.3736 1093.1341 1099.4667 1101.1071 1106.7579 1110.9849 1114.5376 1151.3344 1175.0676 1186.1118 1208.2539 1213.4446 1240.2963 1253.1335 1268.9373 1287.2482 1292.0493 1298.3466 1299.2450 1304.6735 1314.7261 1322.5353 1324.6433 1338.0071 1343.8457 1350.9275 1355.6699 1362.7326 1366.8330 1376.1583 1433.9393 1439.0690 1451.3622 1456.6344 1461.8123 1469.6714 1471.9383 1484.4691 1502.6370 1624.0748 2947.3396 2962.3669 2964.4476 2965.8087 2967.0813 2993.1524 2993.6170 2994.3053 3002.7582 3009.3556 3014.8907 3018.3681 3020.1150 3024.7453 3027.4798 3029.8750 3051.9212 3063.3312 3152.0428 3544.3199 3551.7392
redmass: 5.1728 4.1517 6.8347 6.6652 4.8641 3.3417 5.6617 4.8802 4.5471 2.0547 1.9433 1.6762 1.9367 2.3722 2.3742 2.3048 2.0028 2.5417 2.7619 2.8841 1.4087 4.0502 4.2159 3.6209 3.7635 3.5800 4.1490 9.7477 4.1183 2.8727 2.5329 2.7419 2.1194 1.5592 1.5960 2.0645 2.0892 2.1921 2.2506 2.2027 2.1989 2.3298 4.5636 1.9524 1.7968 1.7815 1.5605 2.0838 1.7702 1.3574 1.8198 1.2588 1.0122 1.0356 1.5619 1.2469 1.8772 1.0993 1.3268 1.3948 1.6957 1.7530 1.8794 1.9348 1.4715 1.8055 1.9274 1.4661 1.3224 1.3139 1.3979 1.4433 1.4374 1.4859 1.5975 1.3714 1.4123 1.1547 1.1024 1.2816 1.1503 1.1014 1.0998 1.1710 1.1224 2.1049 5.1148 1.0643 1.0632 1.0615 1.0614 1.0605 1.0837 1.0615 1.0824 1.0866 1.0945 1.0857 1.1000 1.1024 1.0923 1.1017 1.0992 1.0929 1.0660 1.1119 1.0772 1.0763
irintensity: 1.5216 0.4414 1.2016 10.9071 9.6193 6.6383 1.0821 8.5861 1.1232 0.0750 0.3994 6.1108 18.8481 6.0527 13.1530 0.8636 0.2133 0.0598 4.4585 3.4698 191.6985 18.3441 27.2479 0.2162 1.6156 5.0867 7.6242 9.6076 2.7591 0.6859 7.6066 6.6485 12.1920 0.3028 0.5230 1.7583 0.1158 10.4987 16.3066 4.4372 9.1779 6.6456 0.5586 1.6817 0.7786 0.2622 2.6356 6.3609 0.4627 3.9660 27.5110 7.3020 0.6818 0.1988 0.2573 2.4910 4.2718 33.4461 38.5337 108.2175 32.9807 37.5549 8.8435 2.9641 14.7772 9.4062 21.8826 12.2650 1.1839 1.8108 17.3573 3.3859 2.3315 11.5533 1.3542 6.0903 6.7944 36.3166 14.8437 52.7486 21.6277 1.7854 12.9606 8.3668 67.3682 670.4667 163.3109 48.7014 20.5772 39.9105 10.7899 40.4475 149.1800 95.9425 94.7391 36.1635 55.7071 40.7289 26.0987 8.2757 18.8950 76.8592 74.8663 6.8727 23.2707 17.8166 21.2199 15.4571
temp: 298.150 k
press: 1.00000 atm
elementType: 17 8 7 7 6 6 6 6 6 6 6 6 6 6 6 6 6 1 1 1 1 1 1 1 1 1 1 1 1 1 1 1 1 1 1 1 1 1
symmnumber: 1
zpe: 862193.5 jmol-1
zpe.correction: 0.328392 hartree
zpe.thermalcorrener: 0.344191 hartree
zpe.thermalcorrenthalpy: 0.345135 hartree
zpe.thermalcorrgfe: 0.282642 hartree
zpe.sumelectzpe: -1151.484043 hartree
zpe.sumelectthermal: -1151.468244 hartree
zpe.sumelectthermalent: -1151.467300 hartree
zpe.sumelectthermalfe: -1151.529793 hartree
dipole: -1.4648 -1.6658 -0.8407
dipole: 2.3722
quadrupole: -108.6295 -115.0037 -108.7871
quadrupole: 6.7730 -1.8672 0.0297
quadrupole: 2.1773 -4.1970 2.0197 6.7730 -1.8672 0.0297
hfenergy: -1151.8124348 hartree
pointgroup: C01 [X(C13H21Cl1N2O1)]
dipole: 0.5879661 -0.7150612 0.1183466 debye
polarizability: 190.7050209|3.3595475|150.0126343|-4.3176161|2.9979613|126.5521733 unknown
InChI: InChI=1S/C13H21ClN2O/c14-1-2-15-13(17)16-12-10-4-8-3-9(6-10)7-11(12)5-8/h8-12,15-16H,1-7H2
charge 0 multiplicity 1
38 atoms
Cl -5.801864 -1.35659 -0.51259
O  -1.833049 1.871427 0.220421
N  -0.750964 -0.196681 0.030176
N  -3.032033 -0.105013 0.60514
C  1.446489 0.705422 0.909367
C  1.334641 -0.528239 -1.310355
C  3.504802 0.576272 -0.574531
C  2.672126 -1.502503 0.62264
C  0.551596 0.393167 -0.331206
C  2.710344 1.465161 0.420812
C  1.873111 -0.610397 1.61337
C  2.602012 0.233079 -1.79088
C  1.775467 -1.840448 -0.600574
C  3.933849 -0.736471 0.136693
C  -1.862645 0.599322 0.280179
C  -4.287468 0.604441 0.837804
C  -5.286557 0.466786 -0.312659
H  0.866672 1.342991 1.602978
H  0.686532 -0.763705 -2.177471
H  4.403885 1.121094 -0.924135
H  2.977941 -2.440333 1.127391
H  0.317675 1.350318 -0.834527
H  3.348184 1.728595 1.288212
H  2.415664 2.416072 -0.066454
H  0.982148 -1.155125 1.986981
H  2.496237 -0.375163 2.499048
H  2.308283 1.161283 -2.3204
H  3.1612 -0.394023 -2.513916
H  2.332823 -2.475441 -1.317879
H  0.899087 -2.440519 -0.274922
H  4.519911 -1.37174 -0.557989
H  4.58996 -0.503563 0.99936
H  -0.802182 -1.206267 0.171094
H  -3.075779 -1.12121 0.511308
H  -4.756031 0.267258 1.781437
H  -4.025462 1.6753 0.941055
H  -4.851577 0.751052 -1.281446
H  -6.225229 1.007294 -0.118433
