program: Gaussian 09
title: 000278337
version: EM64L-G09RevD.01
frameworkgroup: C1[X(C11H18N2O2S)]
method: RPBEPBE
basis: SDD
operation: Freq
keyword: #p
keyword: freq=noraman
keyword: PBEPBE/SDD
title: #p freq=noraman PBEPBE/SDD
converged: YES YES NO NO
title: Mulliken charges:
elementType: S O O N N C C C C C C C C C C C H H H H H H H H H H H H H H H H H H
charge: 0.900171 -0.534962 -0.543544 -0.526065 -0.611292 0.314858 -0.463492 -0.707652 -0.733845 -0.015662 -0.229990 -0.266952 0.452678 -0.340666 -0.388101 -0.800118 0.217454 0.278258 0.298417 0.243903 0.212692 0.240572 0.226369 0.210260 0.252409 0.277466 0.286378 0.273554 0.289948 0.241277 0.243437 0.241492 0.228410 0.232339
chargesum: 0.00000
title: Mulliken charges with hydrogens summed into heavy atoms:
elementType: S O O N N C C C C C C C C C C C
charge: 0.900171 -0.534962 -0.543544 -0.227648 -0.047448 0.314858 0.032220 -0.010486 -0.044808 -0.015662 0.043564 0.022996 0.452678 -0.099389 -0.144664 -0.097878
polarizability: 2.31300868e+02 -4.23192756e+00 1.52639995e+02 6.79573372e+00 1.05244499e+01 1.24676913e+02
1716.lowfreq: -12.4800 -6.3000 0.0006 0.0013 0.0023 7.8589 15.9834 24.3371 33.1320
frequency: 15.8179 24.0833 33.0928 43.7614 80.0687 100.1239 120.5926 130.7126 144.4560 169.4255 193.8513 221.2590 229.1224 240.8940 256.0518 273.6580 285.3976 311.0245 333.6847 353.5267 376.9500 390.5972 402.7036 407.4430 447.1113 485.7529 500.9419 524.5890 557.7180 595.8330 622.6494 709.2246 736.2749 774.2898 794.0037 815.4124 826.2390 850.6406 855.1894 879.7045 929.3405 932.0967 960.7039 967.2250 982.4994 987.9219 990.2388 998.0006 1049.4028 1055.0365 1080.8966 1104.6542 1117.4850 1161.7228 1183.6129 1204.2413 1218.7371 1248.3788 1295.5403 1330.1937 1343.6891 1361.6637 1365.9112 1381.0845 1387.0818 1390.9887 1400.2761 1451.2114 1466.0993 1470.5129 1471.3483 1473.4276 1475.0264 1481.4457 1492.6126 1595.4256 1597.8471 1644.5123 2972.9821 2975.2531 2981.3756 2983.4290 3052.8703 3061.6494 3071.6351 3081.9526 3089.7990 3091.4454 3093.5827 3133.9116 3136.5195 3159.4697 3165.8316 3311.8702 3529.3694 3655.2015
redmass: 3.1892 1.2560 2.7445 3.9080 2.4945 1.7728 3.0174 3.8267 3.0390 2.8008 8.0341 5.8243 4.3407 1.1573 2.7329 1.0607 4.9091 4.2029 2.3178 2.6145 3.4400 3.3544 3.3683 2.8597 5.3914 1.2815 3.4431 3.9632 3.7860 5.7552 6.9535 3.2957 3.9373 4.6811 3.5202 2.9814 1.4330 1.2463 1.3656 2.2969 2.1399 2.4496 1.3130 2.0381 1.4064 1.6226 1.2539 3.3305 1.5866 2.5023 1.5206 3.5308 1.2850 2.2497 1.1509 1.9881 2.9609 2.3450 1.2653 1.2230 1.3859 1.2020 1.2292 4.7616 1.2255 3.0549 1.2768 1.0518 1.0683 1.0560 1.0537 2.2271 1.1277 1.0724 1.0580 6.7317 6.2161 1.0953 1.0524 1.0431 1.0380 1.0360 1.1025 1.0966 1.0999 1.1000 1.0997 1.0993 1.0990 1.0893 1.0890 1.0958 1.0962 1.0738 1.0454 1.1005
irintensity: 0.3800 1.1143 0.1716 0.7963 1.3950 5.1873 3.0037 3.7518 2.8473 8.2533 0.5615 14.2721 2.8880 3.7995 5.7573 2.2428 8.5512 1.7896 1.4800 1.5003 5.1788 16.7927 0.8926 0.3043 109.9805 203.9905 26.0994 52.1393 13.3345 58.6194 0.6409 0.9908 7.5535 30.3843 111.6758 59.8704 23.9924 4.2432 7.0553 13.4584 35.7651 35.1340 0.5521 3.0218 0.8774 1.7111 2.1473 5.1870 17.7745 29.4123 6.8707 73.4993 8.6099 99.8824 7.4742 2.5371 5.0844 10.5513 2.6100 0.8490 3.8512 27.2627 6.7857 3.6908 14.1415 10.6166 14.0718 3.0441 0.5408 14.0729 6.9851 26.5851 15.9778 13.5885 21.7888 2.5927 5.9303 43.5370 33.7439 32.1719 27.0591 9.7644 8.4501 17.3933 23.4011 24.0671 3.5218 16.9203 29.1286 13.3557 9.0428 6.9782 5.9415 9.9265 3.0628 7.8788
temp: 298.150 k
press: 1.00000 atm
elementType: 16 8 8 7 7 6 6 6 6 6 6 6 6 6 6 6 1 1 1 1 1 1 1 1 1 1 1 1 1 1 1 1 1 1
symmnumber: 1
zpe: 722006.8 jmol-1
zpe.correction: 0.274998 hartree
zpe.thermalcorrener: 0.294199 hartree
zpe.thermalcorrenthalpy: 0.295143 hartree
zpe.thermalcorrgfe: 0.225684 hartree
zpe.sumelectzpe: -1086.559910 hartree
zpe.sumelectthermal: -1086.540709 hartree
zpe.sumelectthermalent: -1086.539765 hartree
zpe.sumelectthermalfe: -1086.609224 hartree
dipole: 2.1967 -3.9626 2.9159
dipole: 5.3879
quadrupole: -79.4590 -106.1078 -107.9018
quadrupole: 3.7182 1.5456 7.0790
quadrupole: 18.3639 -8.2849 -10.0789 3.7182 1.5456 7.0790
hfenergy: -1086.8349078 hartree
pointgroup: C01 [X(C11H18N2O2S1)]
dipole: 0.8885654 -0.2703865 -1.9054693 debye
polarizability: 231.5615329|-1.1047914|139.1107335|-5.5891166|-17.7014376|137.9455087 unknown
InChI: InChI=1S/C11H18N2O2S/c1-9-4-6-10(7-5-9)16(14,15)13-11(2,3)8-12/h4-7,13H,8,12H2,1-3H3
charge 0 multiplicity 1
34 atoms
S  -0.420916 -0.198036 1.270685
O  -0.38727 -1.211548 2.554386
O  -0.972649 1.326667 1.43538
N  -1.320211 -0.970907 -0.2018
N  -4.51509 0.90212 -1.090028
C  -2.824502 -0.78434 -0.265151
C  -3.089991 0.650413 -0.83736
C  -3.54693 -0.989762 1.08655
C  -3.289488 -1.847293 -1.291567
C  1.331408 -0.139933 0.57519
C  1.660003 0.870898 -0.343038
C  2.251063 -1.091993 1.037834
C  3.955631 -0.034166 -0.398414
C  2.984551 0.912696 -0.826443
C  3.571894 -1.029388 0.536871
C  5.38022 0.041074 -0.916992
H  -2.489861 0.74479 -1.764787
H  -2.684595 1.381461 -0.114694
H  -1.090755 -1.980717 -0.080622
H  -3.20347 -0.257798 1.83965
H  -3.374829 -2.004856 1.488206
H  -4.629872 -0.843677 0.930921
H  -2.723829 -1.760703 -2.23703
H  -3.17397 -2.874939 -0.897664
H  -4.359975 -1.672213 -1.495953
H  -4.814253 0.915039 -2.064018
H  -4.957607 1.61682 -0.514276
H  0.911255 1.604928 -0.656244
H  1.945868 -1.837854 1.779284
H  3.269978 1.689882 -1.545052
H  4.311488 -1.760991 0.881336
H  5.914024 0.906954 -0.480884
H  5.954322 -0.866057 -0.663546
H  5.403757 0.164829 -2.014825
