program: Gaussian 09
title: 000278350
version: EM64L-G09RevD.01
frameworkgroup: C1[X(C14H15Br3O4)]
method: RPBEPBE
basis: SDD
operation: Freq
keyword: #p
keyword: freq=noraman
keyword: PBEPBE/SDD
title: #p freq=noraman PBEPBE/SDD
converged: YES YES NO NO
title: Mulliken charges:
elementType: Br Br Br O O O O C C C C C C C C C C C C C C H H H H H H H H H H H H H H H
charge: 0.048461 0.042325 -0.020703 -0.235513 -0.251368 -0.212136 -0.223075 -0.495419 -0.432311 -0.231339 -0.644282 0.586040 0.254313 0.219073 -0.388724 -0.310308 -0.225915 -0.238364 -0.233260 -0.501454 -0.502303 0.326335 0.369978 0.317201 0.337558 0.231230 0.238076 0.231275 0.231067 0.232543 0.238581 0.246538 0.256157 0.239812 0.246830 0.253080
chargesum: 0.00000
title: Mulliken charges with hydrogens summed into heavy atoms:
elementType: Br Br Br O O O O C C C C C C C C C C C C C C
charge: 0.048461 0.042325 -0.020703 -0.235513 -0.251368 -0.212136 -0.223075 -0.169084 -0.062333 0.085862 -0.306724 0.586040 0.254313 0.219073 -0.157494 -0.072233 0.005360 -0.007296 -0.000716 0.239822 0.237420
polarizability: 2.32942421e+02 1.18946021e+01 2.12295259e+02 1.47779152e+01 -9.66386794e-01 1.99801084e+02
1716.lowfreq: -5.6294 -0.0003 0.0001 0.0005 1.5106 3.2866 20.2864 25.1232 30.7520
frequency: 20.2251 25.1088 30.7450 39.7849 41.9377 52.3736 64.6110 78.4110 81.0323 90.3782 93.3139 98.8688 110.5969 117.0721 140.1390 156.4689 168.8850 190.9949 192.3576 204.7840 223.4723 229.6282 264.9109 311.7526 355.0637 401.4415 405.9512 427.5170 466.6237 499.2063 555.2419 571.9446 592.5169 600.8262 617.0275 668.3875 697.6312 712.2430 725.8719 754.9591 777.8165 821.7977 847.5474 850.7133 856.7986 921.4943 926.0222 977.4214 978.3658 986.6060 990.3546 999.2262 1025.0656 1050.2268 1087.1445 1090.1708 1111.6275 1114.0352 1121.9610 1135.8671 1151.2177 1152.5716 1162.9938 1174.5960 1181.7386 1187.8769 1194.1273 1217.5631 1247.3078 1269.8563 1286.9449 1321.3254 1345.8322 1372.5458 1391.0844 1418.7974 1422.3823 1446.1648 1452.3607 1454.1574 1461.0632 1461.7280 1484.5859 1593.3883 1611.1874 1631.9854 1643.9025 3007.1933 3011.6745 3044.4421 3058.1411 3074.8211 3096.0682 3111.1643 3117.7385 3124.4059 3129.0329 3139.8011 3152.3019 3156.8620 3159.3043 3167.8777
redmass: 6.9367 8.8674 4.9691 5.1903 6.4642 5.6833 6.2787 2.2148 9.3758 1.2905 2.1811 5.0076 4.3745 5.7572 7.8239 5.6155 24.7458 7.6368 5.0249 5.0339 6.3804 5.3268 5.3806 5.0204 6.6213 2.8419 4.7872 5.8727 4.8324 6.4729 6.6921 6.0850 5.2340 5.2919 6.2867 4.7558 1.6520 5.9931 6.0237 6.2186 1.9616 5.0181 1.2818 5.4248 6.0132 8.2839 1.4631 1.8904 2.3204 4.5529 5.9356 1.3394 2.4868 3.5511 1.8188 1.4581 1.2971 1.2909 2.5346 1.4827 1.4131 1.4608 1.6135 1.0913 1.6632 1.3563 1.1638 1.9648 1.4770 1.6308 1.6845 1.3228 1.3543 1.6864 3.9962 1.1901 1.1853 2.1446 1.0501 1.0494 1.0503 1.0502 2.2859 5.9599 6.0165 8.7303 9.7206 1.0293 1.0292 1.0830 1.0831 1.0851 1.0863 1.1048 1.1052 1.0867 1.0870 1.0917 1.0963 1.1050 1.1053 1.1016
irintensity: 0.3236 0.4738 0.6174 1.9136 0.4658 0.6506 1.1360 0.6126 0.5468 0.1265 0.4537 0.4947 0.7093 0.2941 1.1692 2.2957 2.2848 1.5167 8.4640 3.7735 1.5316 3.4242 10.8135 32.9306 12.3236 0.8793 21.3148 13.6441 35.6048 14.1418 6.2238 24.4990 60.0923 30.8833 7.9390 5.0463 55.7927 17.2978 6.6914 20.6054 21.0421 10.9843 0.3323 6.8019 7.4053 19.4205 0.7210 1.9622 2.8429 47.9936 0.7240 0.0828 3.8624 2.5617 17.0351 12.2490 8.0306 11.3034 240.1055 16.3493 4.3997 20.9251 113.9147 4.3211 47.5251 83.1646 7.7278 20.6506 22.9399 23.9734 158.5151 17.6940 47.7005 10.5781 1.3386 26.8197 16.8954 13.8532 13.6366 16.4448 8.1969 12.7642 3.1443 0.8951 2.3118 118.6561 230.5147 27.8636 27.1412 8.7433 1.7655 9.0862 0.5530 21.5469 17.8756 4.4239 1.1573 13.3885 29.9464 11.8215 13.3492 22.2790
temp: 298.150 k
press: 1.00000 atm
elementType: 35 35 35 8 8 8 8 6 6 6 6 6 6 6 6 6 6 6 6 6 6 1 1 1 1 1 1 1 1 1 1 1 1 1 1 1
symmnumber: 1
zpe: 688096.1 jmol-1
zpe.correction: 0.262082 hartree
zpe.thermalcorrener: 0.285879 hartree
zpe.thermalcorrenthalpy: 0.286823 hartree
zpe.thermalcorrgfe: 0.203006 hartree
zpe.sumelectzpe: -882.186176 hartree
zpe.sumelectthermal: -882.162379 hartree
zpe.sumelectthermalent: -882.161435 hartree
zpe.sumelectthermalfe: -882.245253 hartree
dipole: 1.6405 -0.3300 -1.1706
dipole: 2.0421
quadrupole: -126.8837 -140.0592 -152.6414
quadrupole: 10.0132 -0.1483 -6.7184
quadrupole: 12.9778 -0.1978 -12.7799 10.0132 -0.1483 -6.7184
hfenergy: -882.4482581 hartree
pointgroup: C01 [X(C14H15Br3O4)]
dipole: 0.6514401 0.1295064 0.452052 debye
polarizability: 232.8068031|-11.1097934|211.9120947|-15.682322|-0.7100711|200.3198652 unknown
InChI: InChI=1S/C14H15Br3O4/c1-20-13(18)9(14(19)21-2)11(16)12(17)10(15)8-6-4-3-5-7-8/h3-7,9-12H,1-2H3
charge 0 multiplicity 1
36 atoms
Br 0.90026 0.883732 -3.072142
Br -0.372207 2.029745 0.086815
Br -1.951421 -2.054321 -1.92921
O  3.180396 1.762102 -0.660138
O  3.506216 -2.114942 0.289467
O  2.612459 0.805464 1.38793
O  1.216391 -2.230802 0.692053
C  0.78037 -0.286124 -1.412212
C  -0.422828 0.073345 -0.529474
C  2.170439 -0.414662 -0.727498
C  -1.81054 -0.092734 -1.173854
C  -3.000705 0.120991 -0.276151
C  2.646238 0.767082 0.138755
C  2.200605 -1.673689 0.158661
C  -4.107456 0.856532 -0.770632
C  -3.05421 -0.407304 1.040381
C  -5.242295 1.077188 0.039149
C  -4.187804 -0.18827 1.848664
C  -5.284908 0.55621 1.352546
C  3.616959 2.989559 0.053307
C  3.712009 -3.26585 1.207917
H  0.550843 -1.269942 -1.858809
H  -0.332714 -0.501914 0.406792
H  2.919475 -0.54538 -1.527421
H  -1.875765 0.496077 -2.101857
H  -4.075164 1.260862 -1.789644
H  -2.220972 -1.002998 1.430462
H  -6.088344 1.652262 -0.352339
H  -4.219162 -0.59876 2.863733
H  -6.164728 0.724831 1.983272
H  4.014123 3.642148 -0.73561
H  4.389687 2.740467 0.79932
H  2.751369 3.450776 0.557491
H  4.790255 -3.468726 1.161523
H  3.124105 -4.133161 0.865296
H  3.400021 -2.986592 2.227559
