program: Gaussian 09
title: 000278313
version: EM64L-G09RevD.01
frameworkgroup: C1[X(C12H11BrN2O)]
method: RPBEPBE
basis: SDD
operation: Freq
keyword: #p
keyword: freq=noraman
keyword: PBEPBE/SDD
title: #p freq=noraman PBEPBE/SDD
converged: YES YES NO NO
title: Mulliken charges:
elementType: Br O N N C C C C C C C C C C C C H H H H H H H H H H H
charge: -0.043345 -0.254496 0.000839 -0.628128 0.116387 0.174752 0.427422 -0.573752 -0.075800 -0.422735 -0.393168 -0.313598 -0.648284 0.125611 -0.245148 -0.218759 0.338421 0.263792 0.237485 0.270095 0.270249 0.212782 0.240214 0.234699 0.237392 0.326864 0.340208
chargesum: 0.00000
title: Mulliken charges with hydrogens summed into heavy atoms:
elementType: Br O N N C C C C C C C C C C C C
charge: -0.043345 -0.254496 0.000839 0.038945 0.116387 0.174752 0.427422 -0.235331 -0.075800 -0.158943 -0.155683 -0.043503 0.074962 0.125611 -0.010449 0.018633
polarizability: 2.44918884e+02 1.55000150e+01 1.72159127e+02 4.30964813e+00 -2.85971297e+00 1.02030174e+02
1716.lowfreq: -6.8748 -5.1438 0.0002 0.0002 0.0006 6.4684 33.2415 43.8263 65.2706
frequency: 32.8941 43.8057 65.2630 77.1118 136.2629 155.7616 168.8803 222.9620 241.6853 245.8499 288.7745 318.8350 351.2991 381.0272 428.9516 472.8666 479.1471 488.1793 511.2809 540.5058 565.7324 590.3649 597.4945 624.3585 657.8909 701.0271 715.1828 763.9745 768.4947 804.1998 812.6299 880.0229 891.4618 937.5132 970.9679 973.3465 1000.3898 1014.8897 1019.8341 1051.1263 1069.3186 1089.9941 1126.4207 1166.3373 1183.0214 1201.6018 1231.9641 1252.2087 1292.3581 1323.8474 1333.3773 1369.0675 1383.8795 1399.9545 1425.2131 1444.8037 1455.6798 1470.1407 1480.0913 1549.2750 1570.6086 1587.0528 1622.2997 1628.7092 2979.2750 3079.3397 3116.0479 3123.5182 3125.6178 3133.7572 3140.9726 3158.8131 3174.1851 3518.7756 3673.6522
redmass: 6.0513 8.2752 6.3518 5.2243 7.1538 3.6139 5.0121 5.0414 1.1132 2.7995 5.2705 7.6298 4.4224 4.1191 3.8380 4.3065 2.9361 4.4510 1.2047 3.7750 3.8786 1.8123 2.4420 5.8770 4.5822 4.5874 5.4119 4.5254 1.3319 3.9536 3.7180 1.5473 4.6068 1.5513 1.7362 1.4212 1.3371 2.1421 2.8108 1.8714 1.8623 2.6696 1.6271 1.1807 1.4203 1.4116 1.9288 2.0522 2.6650 2.7054 2.8832 2.4462 1.2495 3.1114 6.4150 3.0864 1.0456 1.0732 3.2399 7.2329 3.2564 2.8679 4.5354 2.4972 1.0416 1.0909 1.0948 1.0885 1.0907 1.0942 1.0894 1.0951 1.0992 1.0449 1.1042
irintensity: 2.5327 2.5388 5.5068 1.6195 0.7756 2.1584 4.7011 5.4154 0.6344 0.9616 3.1765 1.0236 10.4612 4.5738 1.4894 10.0982 13.2133 27.4123 125.4371 4.9378 7.6711 68.4296 40.7086 4.1163 18.7960 17.5649 5.2213 0.1873 79.4127 5.8333 11.5144 6.7271 1.1320 15.8256 13.9480 13.3554 0.1644 4.6707 20.1461 3.6584 38.8118 2.4026 17.1637 0.8882 4.8849 25.2168 11.2523 11.7713 50.3199 4.9533 142.0706 8.5832 24.5343 11.4827 52.0053 8.5077 10.3545 8.4071 17.1971 28.4843 53.0667 85.2851 67.1486 218.6772 21.4442 22.0871 6.6214 1.1659 10.2741 8.0764 10.1606 21.8583 19.0842 47.6745 27.6243
temp: 298.150 k
press: 1.00000 atm
elementType: 35 8 7 7 6 6 6 6 6 6 6 6 6 6 6 6 1 1 1 1 1 1 1 1 1 1 1
symmnumber: 1
zpe: 537562.5 jmol-1
zpe.correction: 0.204747 hartree
zpe.thermalcorrener: 0.219213 hartree
zpe.thermalcorrenthalpy: 0.220157 hartree
zpe.thermalcorrgfe: 0.161659 hartree
zpe.sumelectzpe: -660.959521 hartree
zpe.sumelectthermal: -660.945055 hartree
zpe.sumelectthermalent: -660.944111 hartree
zpe.sumelectthermalfe: -661.002609 hartree
dipole: -6.1986 3.6991 2.4391
dipole: 7.6194
quadrupole: -97.8319 -84.4796 -103.6240
quadrupole: -2.7076 8.0406 1.9914
quadrupole: -2.5201 10.8323 -8.3122 -2.7076 8.0406 1.9914
hfenergy: -661.1642677 hartree
pointgroup: C01 [X(C12H11Br1N2O1)]
dipole: 1.711587 1.691024 -1.7880635 debye
polarizability: 245.9410283|10.7381742|164.2045526|-8.0440914|-21.03781|108.9626043 unknown
InChI: InChI=1S/C12H11BrN2O/c1-7(13)11-9(12(14)16)6-8-4-2-3-5-10(8)15-11/h2-7H,14H2,1H3
charge 0 multiplicity 1
27 atoms
Br -2.491016 -2.134692 1.913449
O  -3.422222 1.08285 0.177166
N  0.226822 -1.388553 -0.029037
N  -2.300093 2.564994 -1.200967
C  -0.953769 -0.740819 -0.105804
C  -1.029826 0.707104 -0.232985
C  1.427041 0.776098 -0.063248
C  -2.190629 -1.620101 -0.071554
C  1.407966 -0.670627 -0.006621
C  0.168217 1.436204 -0.192307
C  2.679908 1.466951 -0.001705
C  2.64476 -1.383605 0.096301
C  -2.081818 -2.902383 -0.895045
C  -2.343305 1.439113 -0.386663
C  3.872529 0.747272 0.101119
C  3.853727 -0.685211 0.148381
H  -3.101326 -1.042008 -0.272869
H  0.147001 2.53229 -0.226066
H  2.691465 2.563111 -0.035931
H  2.601723 -2.475871 0.141325
H  -1.183654 -3.472311 -0.611344
H  -1.998616 -2.638666 -1.968686
H  -2.979063 -3.528057 -0.758727
H  4.831097 1.275055 0.14879
H  4.799108 -1.232132 0.231635
H  -1.494767 2.793945 -1.780122
H  -3.15786 3.107348 -1.304783
