program: Gaussian 09
title: 000278303
version: EM64L-G09RevD.01
frameworkgroup: C1[X(C15H21NO)]
method: RPBEPBE
basis: SDD
operation: Freq
keyword: #p
keyword: freq=noraman
keyword: PBEPBE/SDD
title: #p freq=noraman PBEPBE/SDD
converged: YES YES NO NO
title: Mulliken charges:
elementType: O N C C C C C C C C C C C C C C C H H H H H H H H H H H H H H H H H H H H H
charge: -0.242850 -0.119297 0.037135 -0.483049 -0.673988 -0.376921 -0.335460 -0.345664 0.424692 -0.583576 0.358491 -0.339613 -0.336406 -0.442080 -0.448152 -0.262442 -0.244260 0.187152 0.219259 0.195387 0.211854 0.224729 0.232690 0.193172 0.228369 0.188780 0.190975 0.215409 0.209489 0.199750 0.210676 0.198540 0.190863 0.211654 0.224052 0.230349 0.225336 0.224956
chargesum: 0.00000
title: Mulliken charges with hydrogens summed into heavy atoms:
elementType: O N C C C C C C C C C C C C C C C
charge: -0.242850 -0.119297 0.224287 -0.068403 -0.237406 0.048941 0.081689 0.060719 0.424692 -0.174336 0.358491 0.069603 0.066111 -0.218027 -0.217803 -0.037105 -0.019304
polarizability: 1.65342027e+02 1.30678686e+01 1.77806126e+02 1.67864856e+01 -4.79755023e+00 1.41374303e+02
1716.lowfreq: -13.8793 -6.1524 -0.0006 -0.0005 0.0005 3.0317 37.5915 52.5794 82.5074
frequency: 37.5238 52.2880 82.4707 106.9073 170.9317 175.3438 223.9165 237.0582 273.5489 287.9729 301.3513 337.1147 373.2830 395.6177 419.8475 441.9072 456.7246 464.3189 489.2009 496.5120 564.8767 568.8229 587.2349 665.5148 696.6700 744.4557 754.0907 761.8472 804.9469 814.4522 842.6922 845.5298 848.3381 870.9698 899.8169 914.2086 931.3237 947.0589 962.1762 983.1568 997.2862 1017.5858 1027.7382 1054.0456 1055.8267 1067.4965 1080.9505 1088.1925 1104.7016 1108.9184 1120.5708 1149.3825 1173.0522 1173.6937 1185.9476 1198.2248 1212.5449 1223.9938 1230.8979 1248.6034 1257.8563 1266.6872 1281.2234 1294.5787 1300.9523 1324.9972 1337.3992 1340.0711 1346.5133 1354.0786 1361.5103 1367.8144 1372.9692 1382.9703 1385.8935 1436.7476 1444.0509 1448.8459 1453.1288 1456.8833 1464.0076 1466.8406 1471.5642 1485.8737 1493.3229 1589.1153 1611.1660 2790.7987 2847.1976 2858.0587 2947.3125 2949.3038 2956.5201 2970.4690 2977.2870 2984.7994 3025.8937 3029.2469 3034.9927 3050.1009 3052.1016 3065.4661 3076.3649 3079.8972 3103.2038 3113.9305 3134.1162 3157.4119
redmass: 4.6189 3.2662 3.7493 3.8044 3.9556 3.2358 2.4607 2.0897 2.8587 3.0158 2.9129 2.8489 3.8460 1.9403 2.3630 3.3982 2.4194 2.7320 3.2733 2.9883 2.3172 3.2076 2.7158 2.8048 4.2589 3.2742 1.6996 1.9658 3.1488 3.9397 1.6560 2.1492 1.7552 1.5327 2.3798 2.5055 2.5188 1.4385 2.3675 1.3355 2.1827 2.4445 2.2088 1.9867 2.0527 2.2509 2.1917 2.9412 2.1554 2.0800 2.0379 2.8112 1.0879 1.3423 1.5066 1.1375 1.4974 1.3628 1.6724 1.2561 1.2960 1.2580 1.4148 1.2095 1.5692 1.4173 1.2771 1.3749 1.3013 1.3828 1.5795 1.4929 1.2863 2.5330 1.7420 2.1508 1.0800 1.0894 1.0956 1.0937 1.1090 1.1410 1.1578 1.8350 1.2052 6.5914 6.4155 1.0802 1.0712 1.0699 1.0657 1.0667 1.0664 1.0647 1.0627 1.0648 1.0955 1.0946 1.0957 1.0971 1.0903 1.0872 1.0956 1.0973 1.0876 1.0879 1.0920 1.1005
irintensity: 0.2020 0.1134 0.2994 1.6176 0.5351 2.4197 1.0184 1.5780 1.9174 0.8669 9.6384 2.6910 0.4795 0.7037 1.3090 0.9183 1.3584 0.9705 1.8689 5.5890 1.1076 1.3015 5.4423 6.5468 1.6374 8.3150 53.3703 28.6081 1.2281 17.9946 0.9750 8.1149 5.8851 1.1219 2.5655 11.5086 21.8294 0.3970 5.3021 0.6304 18.8155 6.4224 12.1267 6.3353 19.7846 5.0090 4.6102 38.1292 2.2357 16.9802 20.1037 7.5361 0.4209 0.5614 7.0818 0.2274 0.0302 4.0587 1.2676 4.7025 19.2052 7.5917 9.7954 3.7472 7.9959 12.0045 1.1548 3.5731 5.9119 2.6415 0.7682 1.0789 3.6857 2.0601 7.1659 2.4852 1.6640 3.2989 12.9383 15.0908 8.1310 11.3818 9.7385 31.2052 13.9471 0.5618 0.9296 90.0814 46.2718 164.3333 34.5254 48.7909 67.7091 11.6148 50.5383 57.0320 40.6280 52.8176 18.1142 55.1878 34.6153 20.7226 47.4153 34.6860 20.5790 5.9134 29.7298 32.7672
temp: 298.150 k
press: 1.00000 atm
elementType: 8 7 6 6 6 6 6 6 6 6 6 6 6 6 6 6 6 1 1 1 1 1 1 1 1 1 1 1 1 1 1 1 1 1 1 1 1 1
symmnumber: 1
zpe: 869405.3 jmol-1
zpe.correction: 0.331139 hartree
zpe.thermalcorrener: 0.345674 hartree
zpe.thermalcorrenthalpy: 0.346618 hartree
zpe.thermalcorrgfe: 0.289820 hartree
zpe.sumelectzpe: -712.846397 hartree
zpe.sumelectthermal: -712.831862 hartree
zpe.sumelectthermalent: -712.830918 hartree
zpe.sumelectthermalfe: -712.887716 hartree
dipole: -1.0498 1.6854 0.7168
dipole: 2.1111
quadrupole: -113.8961 -96.2603 -99.1674
quadrupole: 6.1982 4.0124 -3.0654
quadrupole: -10.7882 6.8476 3.9406 6.1982 4.0124 -3.0654
hfenergy: -713.1775355 hartree
pointgroup: C01 [X(C15H21N1O1)]
dipole: 0.4106252 -0.6637175 0.2840701 debye
polarizability: 165.8193301|13.0610391|177.8282845|-16.2783213|5.2451178|140.8748411 unknown
InChI: InChI=1S/C15H21NO/c1-2-5-14-12-15(7-3-6-13(14)4-1)16-8-10-17-11-9-16/h1-2,4-5,15H,3,6-12H2
charge 0 multiplicity 1
38 atoms
O  -3.793148 1.328301 -0.711029
N  -1.499968 -0.263166 0.200514
C  -0.762068 -1.175098 1.128085
C  -0.407101 -2.528754 0.459472
C  0.508046 -0.499592 1.740297
C  0.476574 -2.435955 -0.804269
C  -1.883896 1.01832 0.854062
C  -2.714401 -0.892089 -0.388233
C  1.45188 0.211261 0.776565
C  1.93202 -1.969059 -0.522661
C  2.112427 -0.47446 -0.287887
C  -2.588121 1.952186 -0.142038
C  -3.405147 0.071308 -1.366841
C  1.716533 1.590511 0.967489
C  2.988223 0.253575 -1.131159
C  2.595529 2.305611 0.124017
C  3.231854 1.632377 -0.940372
H  -1.421936 -1.426704 2.005072
H  -1.334568 -3.08397 0.223212
H  0.11664 -3.141179 1.22182
H  1.052996 -1.30715 2.272048
H  0.197542 0.215949 2.523831
H  0.010422 -1.75318 -1.538833
H  0.522042 -3.441385 -1.268274
H  -0.978277 1.531573 1.216861
H  -2.558877 0.837504 1.730742
H  -3.443657 -1.194027 0.407607
H  -2.430366 -1.798526 -0.950369
H  2.570379 -2.266522 -1.376034
H  2.30768 -2.534888 0.357582
H  -2.937034 2.870542 0.358973
H  -1.882641 2.2173 -0.959081
H  -2.718835 0.288807 -2.214591
H  -4.341875 -0.365562 -1.751628
H  1.233392 2.113778 1.803345
H  3.493162 -0.274388 -1.94993
H  2.780841 3.371417 0.298431
H  3.914833 2.168937 -1.608498
