program: Gaussian 09
title: 000278291
version: EM64L-G09RevD.01
frameworkgroup: C1[X(C8H5BrO4)]
method: RPBEPBE
basis: SDD
operation: Freq
keyword: #p
keyword: freq=noraman
keyword: PBEPBE/SDD
title: #p freq=noraman PBEPBE/SDD
converged: YES YES NO NO
title: Mulliken charges:
elementType: Br O O O O C C C C C C C C H H H H H
charge: 0.071344 -0.257898 -0.250322 -0.455274 -0.223685 0.219774 0.200779 -0.421418 0.384100 -0.277890 -0.201332 -0.374635 0.108801 0.312706 0.281950 0.246475 0.246742 0.389784
chargesum: 0.00000
title: Mulliken charges with hydrogens summed into heavy atoms:
elementType: Br O O O O C C C C C C C C
charge: 0.071344 -0.257898 -0.250322 -0.065490 -0.223685 0.219774 0.200779 -0.108712 0.384100 0.004059 0.291885 -0.374635 0.108801
polarizability: 1.82716200e+02 4.28847515e+00 1.26094066e+02 -6.27255819e-02 3.81369782e-03 4.67958896e+01
1716.lowfreq: -4.4808 0.0007 0.0009 0.0011 3.0607 4.8516 24.6700 32.6900 85.1136
frequency: 24.0774 32.6552 85.1118 127.3580 160.1610 191.2515 245.5354 265.6093 331.1850 339.8232 377.8827 421.6903 516.2877 559.3450 596.8741 614.2279 644.1138 683.3262 703.4465 712.8998 748.7432 795.4707 833.6237 866.6527 907.5097 912.7465 973.6427 1005.8999 1063.7961 1073.6101 1119.3603 1138.6289 1221.0508 1242.0997 1300.8238 1350.4101 1368.8339 1408.8082 1465.5871 1485.9893 1598.7215 1618.9483 1651.7424 3024.6836 3107.0175 3196.0036 3210.9418 3539.2010
redmass: 2.3521 12.5907 7.7426 9.3618 14.2455 8.9633 6.4291 16.4955 9.7510 10.0978 8.4492 3.0195 5.4064 1.7364 6.6559 2.5847 6.2429 9.9542 5.6492 7.0382 5.5644 6.2698 9.9274 1.4167 8.9518 1.4175 6.7836 3.4943 1.4531 3.3603 1.0369 1.7866 1.4852 2.9001 2.6713 3.0124 1.6035 6.9325 2.7311 1.2841 9.6209 8.6836 9.0690 1.0535 1.1194 1.0937 1.0931 1.0643
irintensity: 15.2438 0.2846 0.0935 0.2957 0.7447 0.5431 0.0628 0.2141 1.5682 0.4439 1.1877 20.7499 55.2918 49.7071 29.7554 96.9720 17.0992 2.2016 11.6662 0.1680 11.0767 15.4829 17.9303 20.1146 49.6484 32.5190 193.2800 279.0284 4.4492 77.5182 0.0133 85.5848 41.5067 157.3622 116.5045 13.7031 11.2260 46.7611 268.7001 43.5170 8.6530 97.8438 242.4190 108.1136 25.3024 0.6560 7.0561 54.0358
temp: 298.150 k
press: 1.00000 atm
elementType: 35 8 8 8 8 6 6 6 6 6 6 6 6 1 1 1 1 1
symmnumber: 1
zpe: 304230.7 jmol-1
zpe.correction: 0.115875 hartree
zpe.thermalcorrener: 0.127308 hartree
zpe.thermalcorrenthalpy: 0.128252 hartree
zpe.thermalcorrgfe: 0.075467 hartree
zpe.sumelectzpe: -621.249365 hartree
zpe.sumelectthermal: -621.237932 hartree
zpe.sumelectthermalent: -621.236988 hartree
zpe.sumelectthermalfe: -621.289773 hartree
dipole: -3.9787 0.2619 0.0198
dipole: 3.9873
quadrupole: -76.0670 -76.6221 -83.6157
quadrupole: 4.5408 0.0030 -0.0058
quadrupole: 2.7013 2.1461 -4.8474 4.5408 0.0030 -0.0058
hfenergy: -621.36524 hartree
pointgroup: C01 [X(C8H5Br1O4)]
dipole: 1.4281395 -0.6491007 0.0049341 debye
dipolederiv: -0.2026186 0.3170818 -0.0102445 0.3095753 -0.3868964 0.0126758 -0.0095314 0.01179 0.01485 -1.3562754 0.3154072 0.010445 0.4084296 -0.5038616 0.0023035 0.0083038 0.0042862 -0.2524655 -1.6161669 0.1516459 0.0259126 0.09322 -0.4447622 0.0085435 0.0321018 0.0069823 -0.2482417 -0.3655567 -0.2331268 0.0120776 -0.3871179 -1.3388112 0.061749 0.0219598 0.0586222 -0.4361592 -1.1437349 0.0385049 0.0150663 0.0619813 -0.5834028 0.015419 0.0152926 0.0162081 -0.3073763 0.7031365 -0.534211 0.0097343 -1.0318281 0.1526073 0.0204229 0.0343227 0.0083345 0.0445163 1.3898635 -0.0591199 -0.0311138 0.3706422 0.1206206 -0.0111102 -0.0551126 -0.0003785 0.0756141 0.139748 0.2338143 -0.0184521 -0.0781798 -0.0582761 -0.0017661 -0.0017577 -0.0091488 -0.128639 -0.8949165 -0.2666893 0.0371726 -0.1608823 -0.3567907 0.0257153 0.0320838 0.0274088 0.0465792 -0.5365596 0.1656259 0.0029225 0.2861387 -0.0893536 -0.0085702 -0.003636 -0.0059157 -0.1084519 1.2270284 -0.159042 -0.0049639 -0.2185508 0.5452352 0.0057568 -0.0012117 0.0037202 0.5635403 0.6438693 -0.5312758 0.0062722 -0.242135 0.7731421 -0.0403532 -0.0095782 -0.0324472 -0.1426588 1.8259728 0.4697869 -0.060679 0.3930882 1.5943295 -0.0898258 -0.0590686 -0.0909086 0.2313589 0.1454576 0.0263258 -0.0004157 0.0226487 0.0577961 0.0057112 -0.0006894 0.0057884 0.182877 0.0933967 -0.0184933 0.0031576 -0.0280814 0.0177524 0.0089898 0.0037047 0.0088131 0.1782964 -0.0931868 0.0305256 -0.0592481 0.037889 0.0661969 0.0034824 -0.1586204 0.0251914 -0.055474 -0.0833359 0.0351647 0.0574668 0.0535573 0.0625949 -0.0183596 0.1524466 -0.0388821 -0.0580133 0.1238784 0.0180749 0.0048896 0.109605 0.3718796 -0.0007841 -0.0010096 0.0005357 0.3998474 unknown
polarizability: 178.4218171|-15.6091215|130.1234853|-2.4837358|-3.9211644|47.0608534 unknown
InChI: InChI=1S/C8H5BrO4/c9-5-2-7-6(12-3-13-7)1-4(5)8(10)11/h1-2,10H,3H2
charge 0 multiplicity 1
18 atoms
Br -2.073918 2.669447 -0.039145
O  2.443361 -1.476538 0.055274
O  2.972805 0.865442 -0.078347
O  -2.552645 -2.061369 0.223183
O  -3.563921 0.018857 0.124375
C  1.26255 -0.697007 0.047277
C  1.581453 0.676836 -0.031277
C  -0.051117 -1.136815 0.103196
C  -1.102595 -0.157685 0.079945
C  0.592907 1.6601 -0.05644
C  3.566397 -0.505997 -0.017332
C  -0.758436 1.225054 0.000331
C  -2.506196 -0.650418 0.139898
H  -0.309575 -2.194143 0.163794
H  0.844983 2.720034 -0.117777
H  4.176549 -0.586039 0.897827
H  4.141126 -0.683082 -0.941504
H  -3.508329 -2.332875 0.259323
