program: Gaussian 09
title: 000278299
version: EM64L-G09RevD.01
frameworkgroup: C1[X(C14H11Cl2NO)]
method: RPBEPBE
basis: SDD
operation: Freq
keyword: #p
keyword: freq=noraman
keyword: PBEPBE/SDD
title: #p freq=noraman PBEPBE/SDD
converged: YES YES NO NO
title: Mulliken charges:
elementType: Cl Cl O N C C C C C C C C C C C C C C H H H H H H H H H H H
charge: -0.051223 -0.040748 -0.259751 -0.076750 0.536094 0.236417 0.322721 -0.370248 -0.297968 -0.275594 -0.361387 -0.331538 -0.351461 -0.353389 -0.223485 -0.217425 -0.093080 -0.537433 0.252577 0.238404 0.288600 0.244132 0.252592 0.230829 0.282251 0.260050 0.224427 0.224310 0.248073
chargesum: 0.00000
title: Mulliken charges with hydrogens summed into heavy atoms:
elementType: Cl Cl O N C C C C C C C C C C C C C C
charge: -0.051223 -0.040748 -0.259751 -0.076750 0.536094 0.236417 0.322721 -0.117670 -0.059564 -0.275594 -0.072786 -0.087406 -0.098869 -0.122559 0.058766 0.042625 -0.093080 0.159378
polarizability: 4.43884274e+02 4.44983361e+00 1.78902052e+02 1.38641143e+00 -5.06511075e+00 7.55284434e+01
1716.lowfreq: -3.7608 -0.0013 0.0009 0.0022 4.4790 6.9293 21.1080 31.5212 43.9941
frequency: 21.0799 31.5170 43.9574 73.2071 115.5038 138.0510 156.6776 159.6523 171.0771 194.3642 206.7128 246.8338 255.3358 321.2802 357.0133 379.3480 391.3682 399.1807 421.2868 452.0052 454.9836 513.2305 527.4250 549.7402 557.2566 630.4820 645.4145 705.6091 710.1057 734.3307 752.0513 809.6736 828.2594 831.8136 840.5934 862.7596 865.3792 948.4820 958.2646 965.9659 984.8239 990.1901 994.4411 1021.4796 1078.3549 1110.7143 1112.6274 1126.5726 1157.3163 1159.5217 1187.5813 1225.3971 1239.2405 1265.0189 1299.4047 1332.7747 1364.1896 1372.3545 1394.6523 1430.9722 1437.1207 1454.2682 1468.9820 1472.6953 1493.5298 1547.1047 1563.9756 1570.7252 1594.2379 1624.1484 2963.8130 3010.9918 3053.3362 3129.7897 3134.5416 3149.5709 3155.1674 3165.9237 3171.1659 3177.2182 3186.2386
redmass: 4.1619 7.1635 7.3715 5.1040 4.2117 6.2669 7.7232 5.0494 4.4871 2.8848 8.2165 1.4030 3.9360 4.1935 7.6555 10.5593 5.5846 6.2939 3.1678 5.3114 3.4032 4.4647 3.0228 5.9865 3.6109 6.9755 7.1447 6.9454 3.7767 3.9022 6.3026 1.2627 6.0858 1.6613 1.4626 4.1646 1.4020 1.3627 1.4048 1.5366 6.6166 1.4427 2.5911 3.8923 2.3933 1.3126 1.2670 1.5525 1.3590 1.4485 1.9242 2.0610 2.3539 1.8342 1.3262 2.4737 4.9323 2.4033 4.5722 4.0310 1.2060 2.6778 1.0505 1.0902 2.4332 8.2901 7.1820 5.7109 7.5049 6.6032 1.0329 1.0868 1.1041 1.0996 1.0886 1.0877 1.0887 1.0956 1.0967 1.0966 1.0936
irintensity: 0.7822 0.1952 0.1602 2.5051 2.4708 0.0788 0.5563 5.0401 6.3181 9.6575 0.6937 4.0921 5.8548 2.5251 17.6072 4.3789 2.6602 13.0582 4.7604 17.0477 7.1308 9.8064 9.9394 7.8706 23.0093 2.9411 5.7245 52.8158 1.5808 2.1268 6.1731 4.4132 15.1073 40.2649 75.2497 26.2173 21.0176 3.1974 4.0984 7.7990 53.8454 9.8384 14.2831 57.8878 55.3651 11.9231 1.7404 8.2985 53.7150 39.0773 50.8521 103.3506 193.9376 40.3546 5.9052 22.0436 5.6242 11.1530 30.4281 4.2447 11.9030 53.9563 15.0506 88.5623 135.1085 20.5119 23.5349 42.4396 85.9156 142.6265 96.5876 41.5450 45.7461 27.7815 4.9749 9.0951 0.1875 10.7331 12.4665 4.0645 0.6097
temp: 298.150 k
press: 1.00000 atm
elementType: 17 17 8 7 6 6 6 6 6 6 6 6 6 6 6 6 6 6 1 1 1 1 1 1 1 1 1 1 1
symmnumber: 1
zpe: 553867.7 jmol-1
zpe.correction: 0.210957 hartree
zpe.thermalcorrener: 0.227506 hartree
zpe.thermalcorrenthalpy: 0.228450 hartree
zpe.thermalcorrgfe: 0.164413 hartree
zpe.sumelectzpe: -1588.891025 hartree
zpe.sumelectthermal: -1588.874476 hartree
zpe.sumelectthermalent: -1588.873532 hartree
zpe.sumelectthermalfe: -1588.937569 hartree
dipole: 3.6143 -1.5116 0.3364
dipole: 3.9321
quadrupole: -100.6123 -111.2651 -122.7504
quadrupole: -10.3059 3.3896 -2.2139
quadrupole: 10.9303 0.2775 -11.2078 -10.3059 3.3896 -2.2139
hfenergy: -1589.1019816 hartree
pointgroup: C01 [X(C14H11Cl2N1O1)]
dipole: 1.4026876 -0.2969877 0.5809362 debye
polarizability: 442.8107863|14.5418673|123.5482481|14.5583805|-51.15561|131.9557348 unknown
InChI: InChI=1S/C14H11Cl2NO/c1-18-13-6-4-12(5-7-13)17-9-10-2-3-11(15)8-14(10)16/h2-9H,1H3
charge 0 multiplicity 1
29 atoms
Cl -2.742356 2.195039 -2.010674
Cl -6.67261 -0.902215 0.34034
O  5.768791 0.427669 -0.13077
N  0.174518 -0.308874 0.295081
C  -2.157381 0.090169 -0.209287
C  1.567677 -0.090065 0.145065
C  4.394468 0.218623 0.030678
C  2.402498 -0.610173 1.168746
C  2.186574 0.571103 -0.962497
C  -3.173822 0.818001 -0.883842
C  -2.586139 -0.966862 0.648185
C  3.802014 -0.452289 1.13091
C  3.57868 0.719761 -1.019485
C  -0.723487 0.38634 -0.364143
C  -4.544405 0.534796 -0.732758
C  -3.944296 -1.27857 0.825829
C  -4.907817 -0.517869 0.128107
C  6.662276 -0.08296 0.913706
H  1.921853 -1.133344 2.001517
H  1.579806 0.944148 -1.795297
H  -1.801597 -1.52759 1.165842
H  4.411761 -0.855632 1.944517
H  4.065848 1.210124 -1.867826
H  -0.471032 1.22601 -1.037305
H  -5.299604 1.114936 -1.26766
H  -4.25385 -2.09174 1.48787
H  6.584746 -1.183613 1.004512
H  6.445913 0.388134 1.891977
H  7.674569 0.19244 0.584467
