program: Gaussian 09
title: 000278316
version: EM64L-G09RevD.01
frameworkgroup: C1[X(C19H24N2)]
method: RPBEPBE
basis: SDD
operation: Freq
keyword: #pfreq=noraman
keyword: PBEPBE/SDD
title: #p freq=noraman PBEPBE/SDD
converged: YES YES NO NO
title: Mulliken charges:
elementType: N N C C C C C C C C C C C C C C C C C C C H H H H H H H H H H H H H H H H H H H H H H H H
charge: -0.116332 -0.489322 -0.036258 -0.065889 -0.050177 -0.536302 -0.458195 -0.457347 -0.445360 -0.412290 -0.394467 0.161042 -0.375181 0.110351 -0.510108 0.174543 0.193573 -0.433849 -0.379730 -0.256802 -0.226467 0.191767 0.192329 0.188842 0.245149 0.170360 0.209503 0.182880 0.198102 0.191552 0.234823 0.187585 0.198633 0.206593 0.199007 0.185918 0.189154 0.211845 0.204736 0.224963 0.297551 0.231126 0.227415 0.216824 0.217907
chargesum: 0.00000
title: Mulliken charges with hydrogens summed into heavy atoms:
elementType: N N C C C C C C C C C C C C C C C C C C C
charge: -0.116332 -0.191771 0.155509 0.126440 0.138665 -0.120793 -0.065811 -0.067694 -0.022952 -0.007064 -0.009541 0.161042 0.025819 0.110351 -0.080409 0.174543 0.193573 -0.202722 -0.152315 -0.039978 -0.008560
polarizability: 2.87947917e+02 1.03141834e+01 2.04639299e+02 -1.95683062e+01 1.30399232e+01 1.47799263e+02
1716.lowfreq: -8.6260 -6.8592 -0.0005 0.0001 0.0004 9.5689 33.5576 47.0089 93.1228
frequency: 33.4742 46.9872 93.1184 109.9664 143.6274 169.6439 180.5826 198.6491 225.6660 261.3780 278.6220 308.7607 317.0984 335.0710 342.8254 358.6687 389.6014 428.5735 449.4353 452.2314 477.7090 489.6328 508.5892 520.3581 562.8772 577.4445 586.6841 605.9007 645.0778 664.8478 712.8499 730.6204 735.4993 747.7121 758.6192 780.9758 809.9171 840.7775 847.4544 849.0741 862.0480 882.9842 900.4775 924.5962 927.2351 935.0092 954.6965 966.8902 980.2288 999.6795 1006.3038 1011.4123 1024.2734 1050.2283 1060.2255 1061.3616 1085.3463 1107.2932 1108.5108 1121.9814 1124.8109 1129.4063 1141.3265 1157.4208 1168.9445 1186.6984 1195.1660 1209.4848 1223.2083 1230.9686 1239.5557 1243.1121 1254.2577 1259.4353 1273.2639 1286.4738 1291.1073 1307.4349 1312.3477 1317.9290 1324.8675 1328.8867 1336.5938 1338.3219 1340.6096 1344.4721 1360.8340 1360.9481 1367.5009 1388.6561 1409.2113 1440.6705 1449.5707 1456.2614 1457.1995 1459.8222 1467.2297 1470.3921 1472.9547 1478.5758 1480.9816 1482.9509 1580.4565 1599.4579 1633.1176 2745.7575 2812.7243 2849.4763 2930.7780 2952.3950 2958.8490 2962.2480 2969.9583 2970.1308 2976.9730 2978.3487 3013.8321 3015.0961 3018.6522 3023.5222 3033.8812 3034.5160 3043.3713 3056.5227 3120.0338 3127.5618 3141.7536 3160.0689 3611.4934
redmass: 4.2042 3.7632 3.6396 3.7951 3.4596 2.7685 2.5770 2.8104 3.6371 3.1384 3.4113 3.2869 2.4841 2.4267 2.4806 2.1771 3.4428 2.9005 2.3346 3.4202 3.6868 1.2354 2.3544 3.5136 4.9739 3.5337 3.7036 2.4478 3.4512 4.4794 4.2068 3.9206 2.5098 1.4189 3.4832 2.2296 1.7483 2.4772 2.3492 1.5858 2.9380 1.9826 2.0906 2.4405 1.3955 2.1362 2.3269 1.2959 1.9568 2.1588 2.0766 2.0317 2.0342 1.8896 1.6110 2.2301 1.6744 1.5132 1.5332 2.1473 2.3380 2.1780 2.3001 1.5591 1.2855 1.3786 1.4976 1.4678 1.4426 1.6039 1.8253 1.2951 1.2795 1.3285 1.4577 1.6238 1.5869 1.4566 1.3716 1.3714 1.6275 1.5233 1.3732 1.6057 1.5778 1.4958 1.6973 1.5172 1.7794 1.4594 3.7679 2.8787 1.1494 1.1077 1.0896 1.0973 1.0846 1.0906 2.1474 1.6390 2.9240 1.0947 6.6607 7.4704 7.0542 1.0768 1.0704 1.0709 1.0800 1.0801 1.0631 1.0646 1.0637 1.0609 1.0634 1.0642 1.0996 1.0878 1.0997 1.0951 1.1021 1.0897 1.1012 1.0960 1.0846 1.0890 1.0950 1.1001 1.0800
irintensity: 0.0705 0.3332 0.4552 0.0994 1.0265 0.5060 1.2806 0.5715 0.9505 0.5699 2.9478 1.4271 0.5665 0.2245 0.1992 0.7196 0.8116 11.1296 0.3051 0.3159 0.6054 75.9418 5.6638 5.4688 1.9487 2.0419 1.1150 3.6667 0.4633 7.3691 5.7495 18.9496 1.7813 86.2329 6.2513 4.8133 5.2234 1.5728 2.1305 0.3541 2.6165 5.9572 0.5513 4.2859 2.6969 0.8673 2.4861 0.0041 1.5403 3.5162 8.7659 9.7594 0.3384 0.4855 2.5749 10.6669 2.0080 8.3255 9.7544 7.2129 20.1744 3.8314 8.0034 21.1237 8.6916 0.8545 6.4205 7.5219 1.4296 5.4615 2.2006 10.7665 9.3142 1.7603 11.7835 7.7474 6.3937 16.5322 3.5111 3.0044 20.9360 5.5003 3.7714 1.2783 73.8933 6.7585 5.4591 5.2646 23.7382 2.5809 13.9879 8.1200 7.5769 11.0808 5.5625 2.6943 11.0826 10.9271 34.2606 13.8288 2.0645 9.3523 0.9641 9.1125 1.9255 68.5660 88.7280 143.8449 28.0632 36.6721 41.0438 83.6042 97.5011 6.8411 46.9575 11.4218 46.1368 27.7402 39.8297 64.8992 34.7445 64.4967 96.7093 43.4936 1.7385 4.1148 38.3704 38.5825 37.8719
temp: 298.150 k
press: 1.00000 atm
elementType: 7 7 6 6 6 6 6 6 6 6 6 6 6 6 6 6 6 6 6 6 6 1 1 1 1 1 1 1 1 1 1 1 1 1 1 1 1 1 1 1 1 1 1 1 1
symmnumber: 1
zpe: 1025428.3 jmol-1
zpe.correction: 0.390565 hartree
zpe.thermalcorrener: 0.407415 hartree
zpe.thermalcorrenthalpy: 0.408359 hartree
zpe.thermalcorrgfe: 0.346790 hartree
zpe.sumelectzpe: -846.388792 hartree
zpe.sumelectthermal: -846.371942 hartree
zpe.sumelectthermalent: -846.370998 hartree
zpe.sumelectthermalfe: -846.432567 hartree
dipole: 2.4244 -0.5833 -1.4566
dipole: 2.8878
quadrupole: -128.1832 -115.4483 -127.9123
quadrupole: 1.4861 -2.3691 4.3308
quadrupole: -4.3353 8.3996 -4.0643 1.4861 -2.3691 4.3308
hfenergy: -846.7793572 hartree
pointgroup: C01 [X(C19H24N2)]
dipole: -0.9544367 -0.224261 0.574125 debye
polarizability: 288.2653372|-10.0237092|203.8713769|-18.6558588|-14.4755251|148.2497653 unknown
InChI: InChI=1S/C19H24N2/c1-2-6-14-12-21-10-9-16-15-7-3-4-8-17(15)20-19(16)18(21)11-13(14)5-1/h3-4,7-8,13-14,18,20H,1-2,5-6,9-12H2
charge 0 multiplicity 1
45 atoms
N  -1.137843 1.445116 0.228174
N  1.535934 -1.162271 0.77517
C  -3.024047 -0.70393 0.925138
C  -3.510604 0.648358 0.321458
C  -0.642006 0.215109 0.910102
C  -1.550629 -0.982854 0.533542
C  -2.511374 1.773835 0.677106
C  -3.974862 -1.866382 0.537314
C  -3.762489 0.547811 -1.204628
C  -4.218537 -1.957852 -0.988806
C  -4.730028 -0.609039 -1.549488
C  0.804552 0.015013 0.537555
C  -0.198323 2.59117 0.344095
C  1.62586 0.95476 -0.077665
C  1.10894 2.324289 -0.438973
C  2.928902 0.342757 -0.246941
C  2.844335 -0.990641 0.300746
C  4.162742 0.779301 -0.797076
C  3.942989 -1.875472 0.306754
C  5.263882 -0.100703 -0.793632
C  5.155841 -1.413849 -0.248371
H  -3.046253 -0.597762 2.033103
H  -4.478865 0.901218 0.806752
H  -0.715894 0.346499 2.029407
H  -1.447625 -1.168099 -0.550255
H  -1.207109 -1.895808 1.063235
H  -2.818681 2.714843 0.182092
H  -2.542063 1.954349 1.785919
H  -4.951154 -1.710119 1.041617
H  -3.569706 -2.825437 0.919411
H  -2.797011 0.40763 -1.726685
H  -4.178453 1.509401 -1.567449
H  -4.949129 -2.762306 -1.202157
H  -3.280068 -2.237853 -1.50804
H  -4.865667 -0.677589 -2.646427
H  -5.729675 -0.394362 -1.115864
H  0.052829 2.80511 1.415433
H  -0.7053 3.485817 -0.06177
H  1.850013 3.1109 -0.193576
H  0.907266 2.393982 -1.52638
H  1.16455 -2.01292 1.191215
H  4.258946 1.785752 -1.220352
H  3.866438 -2.885877 0.72466
H  6.22128 0.225046 -1.215896
H  6.029396 -2.075441 -0.260268
