program: Gaussian 09
title: 000278286
version: EM64L-G09RevD.01
frameworkgroup: C1[X(C8H10N2O)]
method: RPBEPBE
basis: SDD
operation: Freq
keyword: #p
keyword: freq=noraman
keyword: PBEPBE/SDD
title: #p freq=noraman PBEPBE/SDD
converged: YES YES NO NO
title: Mulliken charges:
elementType: O N N C C C C C C C C H H H H H H H H H H
charge: -0.296406 -0.690160 -0.593036 0.361237 -0.687195 0.269623 -0.396757 -0.390582 -0.275026 -0.215914 0.262203 0.216400 0.260496 0.212876 0.212069 0.222389 0.219607 0.360267 0.288714 0.323593 0.335604
chargesum: 0.00000
title: Mulliken charges with hydrogens summed into heavy atoms:
elementType: O N N C C C C C C C C
charge: -0.296406 -0.041179 0.066161 0.361237 -0.210299 0.269623 -0.183882 -0.178514 -0.052637 0.003693 0.262203
polarizability: 1.26402260e+02 -4.24268960e+00 1.18990987e+02 -8.23019642e+00 -1.24118886e+00 5.86978403e+01
1716.lowfreq: -13.8964 -9.4236 -6.9508 -0.0005 -0.0003 0.0002 44.8431 77.8432 133.5724
frequency: 44.8171 77.8369 133.5608 199.6917 255.6929 279.5988 406.2871 409.2005 443.1510 461.5793 489.0555 515.8399 521.6966 547.3816 570.7977 618.3726 690.4845 695.6382 721.1074 748.7433 780.0421 836.9928 861.6409 866.5723 921.3296 934.0715 963.6011 1032.0092 1049.3294 1072.9834 1141.2113 1165.1050 1171.4986 1192.0108 1281.3851 1303.1208 1325.2903 1367.7228 1396.5359 1452.4504 1455.8780 1499.0077 1579.2815 1585.1045 1617.1832 1636.1519 1679.6517 2990.5151 3059.5812 3104.2334 3113.4268 3136.1432 3161.4291 3361.0901 3519.6006 3624.5637 3674.4800
redmass: 4.5765 4.9503 4.3760 5.2555 3.8787 4.5713 3.1775 2.1678 2.3036 1.2610 1.8347 1.8288 2.7302 3.0324 4.0448 1.6838 1.3129 2.6499 2.6521 1.4411 4.0943 1.6127 3.7440 3.4908 1.6179 1.6864 1.3075 2.2375 1.7740 1.7123 1.2873 1.1573 1.0549 2.9611 1.3626 1.6510 1.9442 3.8424 5.7548 2.1060 1.2758 2.9883 2.5250 5.1464 2.3279 2.9011 1.2285 1.0600 1.1016 1.0881 1.0874 1.0927 1.0998 1.0619 1.0451 1.0895 1.1041
irintensity: 11.9203 1.8078 10.8230 5.2271 6.8978 3.6229 2.3346 5.2585 32.7562 67.4178 22.3260 68.7128 57.3960 39.2581 10.1067 106.8177 184.8974 99.7972 12.2021 80.2732 0.8013 4.9585 2.1482 1.1697 2.5097 4.6011 0.2590 5.7787 0.9147 8.5808 5.7213 36.1171 1.5297 6.4005 9.5395 13.9390 23.8722 163.0139 7.1026 16.0484 16.3605 61.4618 49.8841 18.6841 74.5918 393.9116 35.5136 27.0940 11.2027 21.8390 8.1810 32.6989 26.7817 272.2778 37.3759 42.4702 25.2803
temp: 298.150 k
press: 1.00000 atm
elementType: 8 7 7 6 6 6 6 6 6 6 6 1 1 1 1 1 1 1 1 1 1
symmnumber: 1
zpe: 447061.0 jmol-1
zpe.correction: 0.170277 hartree
zpe.thermalcorrener: 0.180285 hartree
zpe.thermalcorrenthalpy: 0.181229 hartree
zpe.thermalcorrgfe: 0.134648 hartree
zpe.sumelectzpe: -494.800268 hartree
zpe.sumelectthermal: -494.790260 hartree
zpe.sumelectthermalent: -494.789316 hartree
zpe.sumelectthermalfe: -494.835896 hartree
dipole: -0.9191 -2.4280 -0.4947
dipole: 2.6429
quadrupole: -62.5487 -54.0487 -66.9486
quadrupole: 11.5149 0.0310 0.2254
quadrupole: -1.3667 7.1333 -5.7666 11.5149 0.0310 0.2254
hfenergy: -494.9705447 hartree
pointgroup: C01 [X(C8H10N2O1)]
dipole: 0.5328717 0.8920158 0.0390156 debye
dipolederiv: -0.6960403 0.0988598 0.1068208 -0.1149527 -0.9780032 -0.0671022 0.1767561 -0.2225866 -0.4675426 -0.5567237 0.359392 0.1093756 0.4027331 -1.2160106 0.0631037 0.0844017 0.241055 -0.5586933 -0.9136749 -0.39043 -0.1234572 -0.4048362 -0.7272595 0.1441865 0.0337525 0.2430347 -0.4905198 0.1748703 -0.1818966 0.0482737 0.2548972 -0.3265969 0.0284751 0.2948442 -0.1437932 -0.1221205 -0.2130213 0.1019996 0.1526734 0.1428711 0.0576586 -0.0032071 0.0956391 -0.0036452 0.0594112 0.1325636 -0.5090358 -0.0781393 -0.4966023 1.1132742 0.047737 -0.1256137 0.0607267 0.0854067 0.1373683 -0.0300438 0.1393975 -0.2283808 0.123574 0.0051067 0.106102 0.0812993 -0.0839366 -0.1222915 0.4036146 0.1401576 -0.0265653 -0.1663293 0.0187286 0.0491769 0.1525765 -0.1579789 -0.3293533 -0.0589071 -0.0360296 -0.0668518 -0.1119831 0.0022911 -0.0794699 0.0086308 -0.2433015 0.0858858 -0.0641008 0.0858406 0.1400907 0.2103646 0.1258848 0.1400414 0.0647896 -0.0645917 1.0064426 0.2635731 -0.3528948 0.4260355 1.356101 0.0420222 -0.6164648 0.0998103 0.4256042 0.0152674 -0.0292096 -0.0260248 -0.0901866 -0.0555266 -0.1492099 -0.0108709 -0.0639321 0.0253229 0.0415642 0.0019557 -0.0066256 0.0649976 -0.0132273 0.127476 -0.0186977 0.0384194 0.0286573 0.0198482 -0.1049166 -0.0924259 -0.0789337 -0.020455 -0.0779069 -0.0731838 -0.0981869 0.0735164 0.0343419 -0.0419525 -0.0674733 -0.0848534 -0.0662329 -0.1008602 -0.078914 -0.0930858 0.1017523 0.0472487 0.0887936 -0.0300807 0.1028805 -0.0956699 -0.0341657 -0.0353033 -0.0372667 0.1566408 -0.109529 0.039914 -0.1005901 0.0375818 0.0894141 -0.0025399 -0.1033922 0.0076626 0.1113708 0.5339018 0.0562352 -0.0065051 0.047371 0.2643556 -0.0317051 0.0239918 -0.1494468 0.3037368 0.114089 -0.0260902 -0.0700201 -0.0117322 0.228148 -0.0548699 -0.0893441 -0.108171 0.2831944 0.3103013 0.0284982 0.1003482 0.024389 0.1562193 -0.0476848 0.1024363 -0.0359613 0.2691343 0.2869406 -0.0062529 0.1073789 -0.0399524 0.1781852 -0.0357601 0.1241124 -0.0419295 0.2649366 unknown
polarizability: 122.7179901|-8.0226281|118.301523|12.8124633|11.540245|63.0715743 unknown
InChI: InChI=1S/C8H10N2O/c9-7-4-2-1-3-6(7)5-8(10)11/h1-4H,5,9-10H2
charge 0 multiplicity 1
21 atoms
O  2.567375 -1.630006 -0.261262
N  -0.227582 -2.271437 -0.127405
N  3.186384 0.597655 -0.142449
C  -0.079705 0.076242 0.599948
C  1.281145 -0.172253 1.24926
C  -0.79315 -0.999659 -0.031103
C  -0.680479 1.354114 0.670736
C  -2.105909 -0.746674 -0.531412
C  -1.973755 1.601521 0.157439
C  -2.68604 0.53238 -0.436604
C  2.394052 -0.46717 0.230852
H  1.554369 0.695627 1.875586
H  1.223852 -1.059776 1.908807
H  -0.132195 2.16783 1.164269
H  -2.660486 -1.566041 -1.006352
H  -2.420591 2.59804 0.232661
H  -3.69482 0.697278 -0.832929
H  0.796589 -2.377007 -0.102812
H  -0.770067 -3.011848 -0.567176
H  3.027123 1.537522 0.214458
H  3.90109 0.450365 -0.855509
