program: Gaussian 09
title: 000278331
version: EM64L-G09RevD.01
frameworkgroup: C1[X(C15H29FN2O)]
method: RPBEPBE
basis: SDD
operation: Freq
keyword: #p
keyword: freq=noraman
keyword: PBEPBE/SDD
title: #p freq=noraman PBEPBE/SDD
converged: NO YES NO NO
title: Mulliken charges:
elementType: F O N N C C C C C C C C C C C C C C C H H H H H H H H H H H H H H H H H H H H H H H H H H H H H
charge: -0.258697 -0.324597 -0.428980 -0.411830 -0.024443 -0.423075 -0.423614 -0.385603 -0.369691 -0.380501 -0.406496 -0.387486 -0.399077 -0.377675 -0.395504 -0.394341 0.300010 -0.366978 -0.193124 0.246949 0.214399 0.172659 0.213940 0.197477 0.192216 0.196249 0.204670 0.200527 0.199017 0.180022 0.189811 0.197107 0.217459 0.198109 0.189965 0.203352 0.193530 0.181498 0.201377 0.207876 0.194830 0.189604 0.266305 0.297294 0.232245 0.257216 0.215461 0.200535
chargesum: 0.00000
title: Mulliken charges with hydrogens summed into heavy atoms:
elementType: F O N N C C C C C C C C C C C C C C C
charge: -0.258697 -0.324597 -0.162675 -0.114536 0.222507 -0.036017 -0.012197 0.002862 0.035506 -0.001463 -0.019578 0.028082 -0.005759 -0.002647 0.013749 -0.009906 0.300010 0.122484 0.222872
polarizability: 2.14501991e+02 4.52703377e+00 1.67351414e+02 2.74333642e+00 -1.36890806e+00 1.55193757e+02
1716.lowfreq: -7.8392 -0.0007 -0.0007 0.0003 5.4544 11.9620 18.2287 19.2129 33.7642
frequency: 17.3752 19.0638 33.6988 53.5957 61.3074 75.2204 92.9956 107.7873 142.4857 155.0636 178.7259 188.8747 207.6919 225.3637 247.9521 255.7327 261.2975 269.2319 288.1291 294.6347 328.1457 332.5444 373.4016 381.5647 426.2790 442.3156 449.3952 478.4664 498.8397 506.0445 539.9051 564.8990 679.8381 690.3000 707.3369 722.0626 757.0774 771.4804 784.8294 804.6723 822.3230 828.0579 835.9601 872.6077 875.3159 900.4782 927.6545 954.4003 962.4971 975.7913 998.6469 1012.3963 1024.7175 1025.5423 1036.0751 1069.4509 1076.4642 1094.0326 1096.3940 1097.8924 1113.2272 1120.2206 1126.7970 1135.6170 1156.8143 1168.4127 1172.4095 1189.3404 1199.1677 1216.3226 1219.7301 1243.8215 1251.9889 1254.5169 1266.3992 1277.5143 1286.1754 1287.5152 1298.2489 1308.5169 1317.9823 1321.6478 1338.6534 1342.1568 1344.8415 1348.7556 1350.5907 1354.9832 1357.7475 1361.3987 1361.9003 1365.4286 1375.3395 1440.9979 1456.1286 1457.3265 1459.1335 1462.8262 1464.0437 1466.5426 1467.0104 1469.9212 1475.7983 1480.2742 1487.4974 1489.7503 1495.9035 1507.7944 1624.4038 2944.2857 2956.0198 2956.6753 2958.0930 2959.4450 2966.8289 2974.6094 2977.2055 2981.6591 2983.6181 2987.6318 2988.4102 3004.5585 3007.3010 3008.0496 3011.4501 3017.3197 3020.6148 3026.7281 3029.9179 3034.3753 3044.1887 3045.0934 3059.4377 3063.4214 3069.2259 3102.6328 3530.9625 3559.2614
redmass: 4.1655 6.2815 4.1399 5.6161 5.4437 3.6589 3.3405 3.1223 3.1998 3.4038 3.2003 2.4228 2.2841 3.2654 2.1895 2.4235 1.8249 3.5924 2.3983 2.3179 2.1785 1.7365 1.5536 2.0685 2.2077 2.4401 2.6725 2.4759 2.6325 2.4244 1.7251 1.7416 3.6369 1.2743 9.2151 1.2498 1.5304 2.0329 1.6468 2.0389 2.0942 2.0187 2.1336 2.3774 2.6545 2.0516 1.9753 1.9901 2.4485 1.9108 2.2355 2.0060 1.8290 2.5020 1.8551 2.4560 2.4604 1.7181 2.0077 1.6924 2.1908 2.4476 2.4044 1.6945 1.5271 1.6733 1.4078 1.2815 1.5819 1.3700 1.4091 1.3094 1.2886 1.3419 1.2208 1.3534 1.2184 1.2189 1.1843 1.1538 1.2208 1.2280 1.3756 1.3328 1.3718 1.3808 1.3204 1.4650 1.3002 1.4019 1.4248 1.3397 1.3520 1.1381 1.1476 1.1663 1.0888 1.1094 1.0905 1.1345 1.0940 1.1475 1.0939 1.1152 1.0750 1.0891 1.1024 2.2045 5.1008 1.0635 1.0602 1.0609 1.0611 1.0689 1.0613 1.0672 1.0629 1.0652 1.0640 1.0634 1.0631 1.0976 1.0969 1.0967 1.0993 1.0984 1.0572 1.0971 1.0956 1.0986 1.0981 1.0889 1.0978 1.0925 1.0915 1.1116 1.0767 1.0771
irintensity: 0.2272 0.0372 0.1079 1.1620 12.3550 8.2495 4.1332 6.5914 0.5115 3.4651 2.3501 0.2002 0.9672 0.9577 0.0931 1.7461 0.4865 7.8046 2.9687 0.3889 5.8287 11.7620 6.9458 3.2946 0.3946 8.1434 7.3907 0.1485 1.2829 0.7093 78.5028 167.2780 4.3296 9.6811 7.3412 21.4570 6.1537 3.0006 1.9282 9.2502 20.3074 6.4582 2.4382 4.4702 11.0110 3.7136 1.2937 4.3101 11.7655 0.3594 17.2103 25.7517 0.7124 11.3295 1.4241 9.7677 2.6707 5.8298 4.1543 3.3466 2.2974 0.5258 0.9938 12.9357 2.9471 8.5443 1.5869 10.7137 3.2128 39.4388 43.0839 8.4051 49.4625 138.4458 26.2738 12.7382 15.1155 17.6082 0.5253 12.6264 2.1149 44.3287 1.8188 1.3849 1.8500 0.9342 3.7587 1.9223 7.2538 6.4206 0.0884 11.2600 1.0803 39.1476 17.8830 6.9300 6.5463 8.8252 6.5934 3.9295 10.7407 1.8919 9.2029 32.0882 6.1368 3.1983 88.8723 522.6319 150.6114 36.5532 34.7552 28.1092 30.2242 33.8907 28.3342 66.2110 59.9946 19.4148 19.3599 12.6670 56.7187 30.8926 26.3921 13.7688 35.4071 30.9768 41.1161 62.5961 68.2920 78.0839 118.9362 33.1835 11.7749 137.5578 4.6739 44.2046 9.9124 21.1123
temp: 298.150 k
press: 1.00000 atm
elementType: 9 8 7 7 6 6 6 6 6 6 6 6 6 6 6 6 6 6 6 1 1 1 1 1 1 1 1 1 1 1 1 1 1 1 1 1 1 1 1 1 1 1 1 1 1 1 1 1
symmnumber: 1
zpe: 1122760.4 jmol-1
zpe.correction: 0.427637 hartree
zpe.thermalcorrener: 0.448827 hartree
zpe.thermalcorrenthalpy: 0.449771 hartree
zpe.thermalcorrgfe: 0.375703 hartree
zpe.sumelectzpe: -872.025747 hartree
zpe.sumelectthermal: -872.004556 hartree
zpe.sumelectthermalent: -872.003612 hartree
zpe.sumelectthermalfe: -872.077680 hartree
dipole: 0.5374 0.1546 -1.8217
dipole: 1.9056
quadrupole: -121.1333 -116.7680 -116.4686
quadrupole: 2.5491 -3.9502 0.4141
quadrupole: -3.0100 1.3553 1.6547 2.5491 -3.9502 0.4141
hfenergy: -872.4533837 hartree
pointgroup: C01 [X(C15H29F1N2O1)]
dipole: -0.2064038 -0.08269 0.715997 debye
polarizability: 213.4613038|-8.6985162|167.2523331|0.9924468|3.8697068|156.3335242 unknown
InChI: InChI=1S/C15H29FN2O/c16-12-13-17-15(19)18-14-10-8-6-4-2-1-3-5-7-9-11-14/h14,17-18H,1-13H2
charge 0 multiplicity 1
48 atoms
F  6.466745 -0.541428 0.334725
O  1.935554 -0.065124 -1.46379
N  1.501989 -0.173158 0.8396
N  3.590494 -0.849108 -0.006382
C  0.117434 0.33902 0.747974
C  -0.019102 1.64208 1.584152
C  -0.911336 -0.755456 1.136314
C  -1.396017 2.363843 1.555224
C  -1.040249 -1.883823 0.084318
C  -1.897503 2.858062 0.166644
C  -2.343691 -2.721031 0.20038
C  -2.630204 1.821218 -0.731033
C  -3.662545 -1.900985 0.120898
C  -3.977421 1.313888 -0.161634
C  -3.85503 -1.094528 -1.194642
C  -4.665277 0.221315 -1.027255
C  2.312213 -0.3427 -0.279033
C  4.559924 -1.062519 -1.079478
C  5.793132 -0.177828 -0.929273
H  -0.010743 0.585008 -0.321181
H  0.762104 2.344648 1.23069
H  0.222876 1.410733 2.645049
H  -1.892271 -0.266567 1.261392
H  -0.651116 -1.178514 2.130222
H  -1.298901 3.248315 2.216895
H  -2.168913 1.72847 2.029928
H  -0.167764 -2.563132 0.152014
H  -0.980164 -1.432283 -0.925418
H  -1.033349 3.270312 -0.394324
H  -2.589869 3.709634 0.332669
H  -2.336405 -3.281229 1.158789
H  -2.340219 -3.483841 -0.605189
H  -1.963229 0.964531 -0.929975
H  -2.821893 2.289765 -1.718694
H  -3.707852 -1.212446 0.98669
H  -4.517576 -2.593999 0.253375
H  -4.670116 2.174983 -0.059827
H  -3.830227 0.92634 0.866424
H  -4.364335 -1.733795 -1.943152
H  -2.870442 -0.850733 -1.634858
H  -5.653432 -0.016317 -0.581377
H  -4.869611 0.642778 -2.033442
H  1.844346 -0.443877 1.763819
H  3.910155 -0.994592 0.951984
H  4.87721 -2.123312 -1.114522
H  4.041479 -0.824088 -2.026884
H  5.529056 0.890622 -0.847105
H  6.52729 -0.349751 -1.7369
