program: Gaussian 09
title: 000278287
version: EM64L-G09RevD.01
frameworkgroup: C1[X(C9H9NO4)]
method: RPBEPBE
basis: SDD
operation: Freq
keyword: #pfreq=noraman
keyword: PBEPBE/SDD
title: #p freq=noraman PBEPBE/SDD
converged: YES YES NO NO
title: Mulliken charges:
elementType: O O O O N C C C C C C C C C H H H H H H H H H
charge: -0.268339 -0.260631 -0.463155 -0.284108 -0.597034 0.513568 0.205971 -0.294451 0.164768 -0.574550 -0.370073 -0.320134 -0.203749 0.176522 0.239973 0.272410 0.272733 0.253624 0.235992 0.241984 0.366212 0.354882 0.337585
chargesum: 0.00000
title: Mulliken charges with hydrogens summed into heavy atoms:
elementType: O O O O N C C C C C C C C C
charge: -0.268339 -0.260631 -0.096943 -0.284108 0.095433 0.513568 0.205971 -0.054479 0.164768 -0.302140 -0.097340 -0.066511 0.274227 0.176522
polarizability: 1.67013319e+02 1.10039340e+01 1.02892445e+02 2.62657160e+00 -8.78666601e+00 7.46849720e+01
1716.lowfreq: -7.0816 -1.4625 -0.0011 -0.0006 -0.0003 13.8524 40.1551 54.1543 67.1562
frequency: 39.3080 54.1459 67.1416 92.2619 169.1038 181.9866 230.9423 290.5965 306.4324 353.1772 389.0469 419.1356 452.9413 495.6878 529.2645 560.3508 580.5545 602.9289 617.1163 638.2186 672.7229 683.5067 722.1619 774.4250 784.8342 812.1740 836.4931 851.7004 883.3615 908.1224 951.1949 972.8210 1039.5322 1055.7900 1071.0314 1072.8015 1126.5751 1130.5095 1168.7784 1198.5721 1246.3171 1261.5582 1292.7569 1338.6936 1362.8829 1384.7957 1404.5215 1439.5675 1473.0626 1485.7158 1588.2083 1607.8593 1628.8562 1646.7361 2928.6210 3002.5313 3110.5666 3148.0426 3165.1889 3184.9344 3365.0669 3507.7425 3657.1910
redmass: 6.0009 6.2513 4.4015 2.8120 6.9702 6.5053 6.3824 7.4210 5.3461 5.7170 5.3094 3.0923 3.1457 2.8006 1.4568 2.5806 1.2461 4.5538 3.6865 1.9514 4.7042 5.6787 4.6281 6.7107 4.5725 1.8401 7.9665 1.8332 1.9303 3.6255 1.3584 5.8267 4.4478 3.1077 1.4933 2.2379 1.0961 1.2888 1.7944 1.2211 4.7166 1.3783 1.3077 2.9628 1.2700 1.7389 3.2246 4.7219 2.2663 1.3197 1.5115 7.6014 7.8064 3.3145 1.0819 1.0605 1.1110 1.0924 1.0887 1.0968 1.0640 1.0451 1.1043
irintensity: 1.8319 4.1667 4.7628 15.8175 3.1707 0.6086 2.1593 9.9184 21.9643 9.5733 4.5114 3.8757 7.3162 5.0745 75.1812 20.6259 129.5516 2.9824 47.8773 120.6480 26.9147 12.1665 3.3959 22.1818 18.9496 28.3945 27.2314 7.7586 41.9017 6.2026 0.3758 148.8335 48.5985 20.0973 8.4299 13.5282 0.8434 7.8613 21.9279 20.7723 247.4278 27.0425 47.9522 133.3293 1.4253 51.5747 18.5518 28.1899 131.9398 32.5509 94.7547 6.1441 1.1739 246.6653 38.1893 120.6194 28.8261 2.6984 0.9730 3.2243 75.6446 32.3970 65.0789
temp: 298.150 k
press: 1.00000 atm
elementType: 8 8 8 8 7 6 6 6 6 6 6 6 6 6 1 1 1 1 1 1 1 1 1
symmnumber: 1
zpe: 448712.5 jmol-1
zpe.correction: 0.170906 hartree
zpe.thermalcorrener: 0.183212 hartree
zpe.thermalcorrenthalpy: 0.184156 hartree
zpe.thermalcorrgfe: 0.131298 hartree
zpe.sumelectzpe: -702.960816 hartree
zpe.sumelectthermal: -702.948510 hartree
zpe.sumelectthermalent: -702.947566 hartree
zpe.sumelectthermalfe: -703.000424 hartree
dipole: -3.1926 -3.1441 -1.2328
dipole: 4.6473
quadrupole: -85.4048 -76.4863 -81.7716
quadrupole: -4.1700 -2.9059 0.0035
quadrupole: -4.1839 4.7346 -0.5507 -4.1700 -2.9059 0.0035
hfenergy: -703.131722 hartree
pointgroup: C01 [X(C9H9N1O4)]
dipole: 1.2242402 -0.7992022 1.097979 debye
dipolederiv: -1.2841683 0.2243969 -0.1431374 0.3587638 -0.5247803 0.0665735 -0.2364607 0.0590235 -0.292511 -1.4075936 0.1167756 -0.1733389 0.0976065 -0.431694 -0.0128283 -0.288144 0.0095638 -0.3016395 -0.6286678 0.0107306 -0.1308375 0.0980109 -0.489894 0.0237381 -0.3085418 0.0638077 -0.5869491 -1.1552501 0.195984 -0.1717761 0.2303999 -0.4378501 0.143097 0.2136985 0.0875491 -0.6019722 -0.4860792 0.0042904 -0.1741015 0.0207515 -0.7395784 0.1937407 -0.2086196 0.2495484 -0.8407611 0.1282035 -0.0089845 -0.0806767 0.1518105 -0.0077195 0.0084196 -0.0141067 -0.0086132 -0.1337224 0.7060473 -0.289297 0.1275485 -0.8951072 0.3029703 -0.1596178 0.1701788 -0.0591007 0.0799566 0.3314125 -0.0389386 0.3041053 -0.0178119 0.4617399 -0.0683467 0.4492017 0.0096188 0.239822 1.0742435 -0.0399668 0.2218649 0.4807234 -0.1013526 0.0741588 0.2937662 -0.0261944 0.084425 -0.1760135 0.0620345 0.0425552 -0.0617874 -0.0037634 0.0196349 0.079435 0.0702479 -0.1921912 -0.1898725 0.0254213 0.0419354 -0.1584905 -0.0342841 -0.0071225 0.0550117 -0.019376 -0.1154016 -0.0461461 -0.0235089 0.0175575 0.0711747 0.1168762 0.0215896 0.0171487 -0.0053266 -0.1396309 1.1945741 -0.1296226 0.0088512 -0.1672358 0.5645097 -0.0021701 -0.0028647 0.0015975 0.5729881 1.2005424 -0.3667665 0.2162841 -0.3628522 0.4096052 -0.3280828 -0.2284525 -0.3746641 0.9774073 0.0053196 0.0359618 -0.0027539 -0.018651 -0.1752898 -0.0159183 -0.0095087 -0.0142925 0.012989 0.1053039 -0.0455507 -0.0281411 -0.0414775 -0.0347068 -0.0136628 -0.0358457 -0.0291694 0.1614164 0.0585059 0.0740325 -0.022331 0.0678274 0.0526088 0.007351 -0.0115816 0.024526 0.152767 0.0813715 -0.0479766 -0.0213044 -0.0507429 -0.0316967 -0.0097258 -0.0251269 -0.0092915 0.16693 -0.117417 0.0315495 0.0572381 0.0296972 0.0461311 -0.0056175 0.2039806 -0.035886 -0.0776666 -0.0642163 0.0334 -0.0624394 0.04317 0.0663197 0.0256276 -0.1303567 0.0394777 -0.051863 0.2441362 0.0310451 -0.0186064 -0.0314549 0.3137611 -0.011875 0.0830857 -0.0628272 0.4529449 0.2495236 0.091833 -0.0221062 0.0843883 0.334734 0.0118846 -0.0875392 -0.0095823 0.2343682 0.1762404 0.053157 0.0136104 0.0712873 0.3433537 0.0391521 0.0216419 0.0393633 0.198294 unknown
polarizability: 166.3548571|-5.9831237|103.1356659|12.8048978|-7.6830479|75.1002129 unknown
InChI: InChI=1S/C9H9NO4/c10-9(12)8(11)5-1-2-6-7(3-5)14-4-13-6/h1-3,8,11H,4,10H2
charge 0 multiplicity 1
23 atoms
O  2.76681 -1.430339 0.334485
O  3.321787 0.898067 0.504564
O  -2.714046 0.44271 -1.716242
O  -4.160668 -0.060127 0.44375
N  -2.449073 -1.129225 1.607224
C  -0.64663 -0.056569 -0.486919
C  1.630947 -0.62967 0.052159
C  -2.082908 -0.471906 -0.785355
C  1.957097 0.739734 0.149122
C  0.34175 -1.062455 -0.266759
C  -0.310532 1.315526 -0.397946
C  1.006588 1.73913 -0.0760
C  3.900539 -0.469107 0.429873
C  -2.981652 -0.530655 0.495983
H  -2.081885 -1.502169 -1.207103
H  0.116177 -2.127945 -0.381969
H  -1.085669 2.054727 -0.618376
H  1.26908 2.798118 -0.012521
H  4.517918 -0.551255 -0.484376
H  4.464761 -0.67179 1.3529
H  -3.643166 0.59206 -1.368269
H  -1.4627 -1.386473 1.644684
H  -3.022522 -1.213687 2.446292
