program: Gaussian 09
title: 000278302
version: EM64L-G09RevD.01
frameworkgroup: C1[X(C16H23NO)]
method: RPBEPBE
basis: SDD
operation: Freq
keyword: #p
keyword: freq=noraman
keyword: PBEPBE/SDD
title: #p freq=noraman PBEPBE/SDD
converged: YES YES NO NO
title: Mulliken charges:
elementType: O N C C C C C C C C C C C C C C C C H H H H H H H H H H H H H H H H H H H H H H H
charge: -0.449830 -0.100717 -0.029608 -0.466557 -0.373219 -0.360282 -0.358500 -0.410606 -0.410496 -0.380980 -0.397873 0.464732 -0.575830 0.368028 -0.440315 -0.450358 -0.270733 -0.240539 0.174382 0.210590 0.214211 0.215830 0.166715 0.223763 0.220750 0.169182 0.189467 0.212674 0.206516 0.190337 0.191976 0.232165 0.213622 0.186874 0.231567 0.198970 0.220649 0.332926 0.230013 0.225930 0.224574
chargesum: 0.00000
title: Mulliken charges with hydrogens summed into heavy atoms:
elementType: O N C C C C C C C C C C C C C C C C
charge: -0.116904 -0.100717 0.144774 -0.041756 -0.157389 0.030196 0.031432 -0.008465 -0.013642 0.043161 0.002624 0.464732 -0.145293 0.368028 -0.219666 -0.220345 -0.044804 -0.015965
polarizability: 1.75828093e+02 -1.23390843e+01 1.87047753e+02 1.48485693e+01 3.75713862e+00 1.57108241e+02
1716.lowfreq: -9.1148 -4.5727 -0.0006 -0.0006 0.0007 12.4654 31.6261 42.0891 79.0277
frequency: 31.1120 41.7812 79.0157 99.7848 152.7722 173.7481 174.8650 221.4505 238.2471 259.7215 273.5194 284.2354 291.3462 333.7378 350.1650 362.4936 377.8853 435.1184 438.2595 450.4788 467.8270 487.1431 548.7658 556.7979 585.2431 595.9587 687.2116 697.3792 753.6696 759.3154 771.7574 802.0569 808.0358 825.2561 854.7031 859.5886 870.9843 883.4297 915.1378 927.5115 942.2368 954.2971 957.2098 968.4510 983.9730 989.6614 1018.5828 1040.4428 1060.3575 1063.6684 1081.4687 1089.5278 1108.8118 1122.1425 1127.7687 1148.2210 1153.3916 1161.9290 1173.1174 1179.2842 1191.3841 1220.6623 1225.6031 1241.7740 1255.8102 1258.6607 1270.3027 1282.9244 1287.0067 1293.9109 1319.2281 1332.5739 1340.7632 1344.5509 1348.9598 1353.6631 1356.5001 1368.7065 1373.9083 1380.1167 1387.8710 1409.6166 1444.9557 1450.3301 1457.7000 1460.3409 1461.6068 1463.8848 1466.1189 1475.7013 1480.0156 1491.1176 1590.7139 1612.1173 2739.2236 2805.1729 2819.8677 2966.4901 2973.8108 2975.3350 2982.9256 2983.8545 2985.8524 3000.8229 3032.4663 3034.4719 3038.8441 3042.7586 3052.2694 3052.6840 3067.3360 3073.5701 3103.9870 3115.3364 3134.7902 3157.6392 3526.5312
redmass: 3.3172 3.6359 3.5774 3.4121 4.2107 3.7501 3.2759 1.9700 2.2066 1.2456 3.9358 2.6212 3.4512 2.8853 3.0263 4.7692 1.7440 2.4350 3.2272 2.4361 2.8137 2.5675 4.0524 2.2490 2.9350 3.2588 4.3361 3.3361 1.6381 3.2569 2.2131 1.4813 3.0330 2.8897 1.5895 2.2010 1.6547 1.6883 2.6397 2.7694 1.7181 1.7040 1.5861 3.7627 1.5046 2.1450 2.3788 2.4451 2.0447 1.8848 1.7430 1.9407 2.0501 2.3543 2.3325 2.0937 1.4027 1.3963 1.1556 1.2304 1.2907 1.8565 1.5969 1.5015 1.2798 1.2824 1.1673 1.2781 1.3438 1.3391 1.4175 1.3294 1.3819 1.4206 1.4305 1.4569 1.4172 1.4431 1.4376 3.7836 1.3859 1.5745 2.1192 1.0885 1.0861 1.0875 1.1127 1.0939 1.0971 1.1046 1.1034 2.3466 6.6437 6.3354 1.0788 1.0720 1.0705 1.0621 1.0834 1.0615 1.0616 1.0609 1.0617 1.0625 1.0967 1.0999 1.0999 1.1029 1.0995 1.1027 1.0856 1.0859 1.0876 1.0876 1.0922 1.1005 1.0657
irintensity: 0.1500 0.1196 0.0585 0.7806 5.9897 0.7270 0.7326 2.2845 14.2900 97.6088 16.6012 7.6204 19.5366 2.4904 0.8036 1.6560 1.9869 0.8760 1.4696 0.9839 3.0836 2.6386 0.6139 3.8027 3.1230 6.1027 1.5159 10.8227 59.6802 4.4292 43.2366 0.0644 7.8807 4.0210 10.7957 7.6974 0.5326 1.5151 3.9648 7.5413 34.5110 1.2745 4.9489 58.0515 3.0091 5.4537 6.5080 5.8271 5.0753 7.2700 6.3379 19.6120 4.1824 7.7678 3.3735 11.7687 14.5471 44.6617 1.4702 0.6076 11.6113 8.0198 4.1989 6.7274 1.6006 3.3863 7.2263 1.6964 2.5487 12.2262 13.0492 2.1042 0.1734 2.8942 0.4448 3.2153 0.8277 2.1890 0.5250 3.5954 2.5390 12.1883 10.0282 5.9144 4.3108 18.4274 6.4067 4.3859 14.5731 16.7929 16.2594 9.1287 0.5871 4.1856 108.1255 44.1365 206.2045 41.5443 54.6048 14.1862 29.5776 61.1117 23.9409 48.7446 69.2222 30.3060 14.1016 37.1879 53.6759 71.7437 46.9810 19.6448 18.4825 5.2683 30.1759 33.6141 6.9128
temp: 298.150 k
press: 1.00000 atm
elementType: 8 7 6 6 6 6 6 6 6 6 6 6 6 6 6 6 6 6 1 1 1 1 1 1 1 1 1 1 1 1 1 1 1 1 1 1 1 1 1 1 1
symmnumber: 1
zpe: 941563.9 jmol-1
zpe.correction: 0.358623 hartree
zpe.thermalcorrener: 0.374762 hartree
zpe.thermalcorrenthalpy: 0.375706 hartree
zpe.thermalcorrgfe: 0.315501 hartree
zpe.sumelectzpe: -752.076660 hartree
zpe.sumelectthermal: -752.060521 hartree
zpe.sumelectthermalent: -752.059576 hartree
zpe.sumelectthermalfe: -752.119781 hartree
dipole: 2.3627 -0.3380 0.5758
dipole: 2.4552
quadrupole: -112.4832 -102.9910 -103.2746
quadrupole: -3.5222 6.1501 0.2295
quadrupole: -6.2336 3.2586 2.9750 -3.5222 6.1501 0.2295
hfenergy: -752.4352826 hartree
pointgroup: C01 [X(C16H23N1O1)]
dipole: -0.9372608 -0.1054506 -0.2085284 debye
polarizability: 177.1049499|12.4109091|186.4385603|14.4475976|-4.1470587|156.4405769 unknown
InChI: InChI=1S/C16H23NO/c18-16-14-9-3-2-7-13(14)8-6-10-15(16)17-11-4-1-5-12-17/h2-3,7,9,15-16,18H,1,4-6,8,10-12H2
charge 0 multiplicity 1
41 atoms
O  1.371202 -1.684394 -2.108082
N  -1.569452 -0.2365 -0.120879
C  -0.749578 -1.250313 -0.855666
C  -0.397361 -2.477926 0.023319
C  0.531647 -0.613958 -1.506602
C  -1.917308 0.945392 -0.95908
C  -2.80356 -0.828631 0.469528
C  -2.681642 2.01861 -0.156865
C  -3.591959 0.19572 1.310742
C  0.367466 -2.155565 1.324274
C  -3.962888 1.437205 0.47427
C  1.432394 0.216972 -0.602097
C  1.836142 -1.716727 1.079038
C  2.022283 -0.283751 0.597139
C  1.711252 1.545646 -1.005876
C  2.850941 0.583901 1.352387
C  2.537995 2.399466 -0.244297
C  3.108855 1.913558 0.950876
H  -1.346946 -1.651762 -1.728061
H  0.227115 -3.151982 -0.593577
H  -1.320655 -3.042075 0.252002
H  0.194784 0.041503 -2.335049
H  -2.536157 0.63476 -1.84525
H  -0.990945 1.400524 -1.342945
H  -2.522627 -1.673383 1.118835
H  -3.472822 -1.235482 -0.337061
H  -2.920218 2.867133 -0.827036
H  -2.016033 2.399392 0.641782
H  -2.966916 0.504617 2.171179
H  -4.498863 -0.294368 1.715331
H  0.383546 -3.06873 1.952272
H  -0.165788 -1.371078 1.89328
H  -4.47099 2.194765 1.100467
H  -4.674182 1.14651 -0.326863
H  2.282433 -2.406792 0.33542
H  2.406003 -1.843323 2.019095
H  1.280373 1.915596 -1.945843
H  0.824116 -2.159678 -2.786956
H  3.305576 0.203784 2.275667
H  2.735989 3.422667 -0.581965
H  3.753278 2.5570 1.560749
