program: Gaussian 09
title: 000278297
version: EM64L-G09RevD.01
frameworkgroup: C1[X(C14H19N3O2)]
method: RPBEPBE
basis: SDD
operation: Freq
keyword: #p
keyword: freq=noraman
keyword: PBEPBE/SDD
title: #p freq=noraman PBEPBE/SDD
converged: YES YES NO NO
title: Mulliken charges:
elementType: O O N N N C C C C C C C C C C C C C C H H H H H H H H H H H H H H H H H H H
charge: -0.219704 -0.231067 -0.444582 -0.067135 -0.355134 -0.028793 -0.540292 0.060675 -0.419867 -0.099273 -0.513483 0.240256 -0.513792 0.021939 -0.526020 -0.524125 -0.754220 0.155240 0.156477 0.218706 0.210313 0.247039 0.208433 0.212604 0.261892 0.228106 0.221395 0.224292 0.223915 0.251191 0.256851 0.274679 0.247331 0.228269 0.217570 0.207150 0.316238 0.346924
chargesum: 0.00000
title: Mulliken charges with hydrogens summed into heavy atoms:
elementType: O O N N N C C C C C C C C C C C C C C
charge: -0.219704 -0.231067 -0.128344 -0.067135 -0.008209 0.189913 -0.082940 0.060675 0.001170 0.162620 -0.063983 0.240256 -0.065585 0.021939 -0.017977 -0.002115 -0.101232 0.155240 0.156477
polarizability: 2.03432503e+02 8.84872271e+00 1.72702527e+02 2.06829755e+01 -3.12921262e+00 1.26047799e+02
1716.lowfreq: -5.4244 -0.0007 -0.0006 -0.0002 3.4471 9.1572 22.4264 36.8092 48.1068
frequency: 22.0429 36.7910 48.0714 78.0843 86.3861 100.3211 146.5316 152.4333 196.1783 214.7177 223.2501 274.2102 282.4874 307.0118 313.1317 355.6726 380.9703 402.1052 407.4153 446.3122 467.0981 490.7557 506.2449 515.9142 530.4532 574.3374 589.5390 635.7929 655.1341 663.9677 701.1440 730.7951 786.0806 792.0253 803.6515 825.5615 851.4030 870.8662 872.0073 912.3436 917.0499 928.1206 938.8381 950.8299 955.3937 1014.8447 1023.9906 1064.6336 1083.1990 1088.2637 1096.1515 1123.1947 1135.4552 1145.0914 1146.8214 1159.8477 1203.9981 1209.2159 1220.9396 1242.8791 1251.6016 1273.9798 1275.1929 1289.3167 1300.1196 1303.4390 1317.1724 1322.3533 1332.7368 1336.9704 1347.9016 1354.7458 1358.3180 1370.5979 1384.9298 1388.5717 1438.0508 1445.2559 1448.8251 1457.1824 1460.9318 1466.0448 1470.6319 1476.2317 1479.5587 1495.1506 1582.9104 1633.4589 1640.9401 2947.3868 2961.4304 2962.0255 2967.7942 2978.8328 2984.3831 2985.5727 2990.5588 3014.3094 3018.6352 3026.4678 3042.8350 3050.8003 3062.4717 3070.7567 3074.3125 3080.5784 3480.3310 3611.7958
redmass: 5.3642 5.4532 6.0464 3.8144 3.4738 5.9885 3.7037 4.9301 2.7954 1.5192 1.3500 2.5384 2.7407 2.3538 2.8880 8.0306 4.6962 2.3770 2.7947 3.3256 3.6094 3.3899 4.2122 4.4640 2.6574 2.1064 3.2716 2.1383 2.8804 4.6172 4.3933 4.0579 3.1025 1.9947 1.5025 2.9110 2.1880 2.4976 1.9957 2.0048 2.0160 1.8443 2.7385 1.4075 2.4870 2.8980 2.3005 2.3186 2.3379 1.9398 1.7871 3.3975 1.5879 1.3601 1.3699 1.7152 2.2177 1.4553 1.6610 1.4048 1.4997 1.7275 1.7006 1.3643 1.8558 1.5183 1.9179 1.7972 1.5162 1.6157 1.4946 1.5307 1.6812 1.8616 2.1597 1.2246 1.0812 2.5070 1.1880 1.1114 1.1259 1.1415 1.2029 1.0637 1.0587 5.5145 5.1778 8.8450 6.1535 1.0687 1.0693 1.0689 1.0369 1.0642 1.0659 1.0667 1.0611 1.0961 1.0958 1.0872 1.1026 1.1003 1.0989 1.0994 1.0941 1.0937 1.0759 1.0819
irintensity: 0.5987 1.6165 0.0512 1.2330 0.1554 4.0892 3.4938 3.7281 0.2305 1.2524 0.5282 0.1864 6.0890 2.0616 8.2836 14.1516 0.1745 9.2061 2.0276 5.5517 11.4542 1.3416 1.3062 10.4236 3.4137 42.1081 10.1199 27.9299 24.0615 0.0934 1.6620 1.1637 10.7103 6.3498 70.4431 34.4905 4.6374 0.8403 11.5984 2.3158 1.7437 1.4611 9.8327 3.9888 9.5990 2.5661 4.2420 3.0839 5.2445 8.1488 1.2298 6.3857 9.5138 12.3190 115.9970 1.9778 4.7723 1.1845 40.1082 1.7185 6.6739 130.0583 58.9069 1.7451 28.2153 7.3956 23.8803 11.0804 13.8912 16.0263 11.1653 16.9744 2.6659 14.7909 0.3357 14.0565 9.9087 13.9228 17.7934 2.2586 15.1018 1.2291 3.3867 9.9197 10.1023 21.3749 13.1992 164.6292 410.9844 12.3934 5.0294 58.3231 27.5195 55.4135 24.1143 7.9589 20.1001 41.0329 11.5037 8.9459 35.2462 22.8514 62.9904 37.6928 10.0278 4.9261 33.4296 62.7204
temp: 298.150 k
press: 1.00000 atm
elementType: 8 8 7 7 7 6 6 6 6 6 6 6 6 6 6 6 6 6 6 1 1 1 1 1 1 1 1 1 1 1 1 1 1 1 1 1 1 1
symmnumber: 1
zpe: 830880.6 jmol-1
zpe.correction: 0.316466 hartree
zpe.thermalcorrener: 0.333783 hartree
zpe.thermalcorrenthalpy: 0.334727 hartree
zpe.thermalcorrgfe: 0.270235 hartree
zpe.sumelectzpe: -858.201729 hartree
zpe.sumelectthermal: -858.184412 hartree
zpe.sumelectthermalent: -858.183468 hartree
zpe.sumelectthermalfe: -858.247960 hartree
dipole: 3.9047 -1.9207 1.6276
dipole: 4.6460
quadrupole: -111.7794 -116.9850 -115.1079
quadrupole: -0.2046 -7.3710 -6.9303
quadrupole: 2.8447 -2.3609 -0.4838 -0.2046 -7.3710 -6.9303
hfenergy: -858.5181946 hartree
pointgroup: C01 [X(C14H19N3O2)]
dipole: -1.5192541 -0.7677269 -0.6660013 debye
polarizability: 201.9470703|-8.406338|172.9227121|23.3690268|1.3596204|127.3130466 unknown
InChI: InChI=1S/C14H19N3O2/c1-8-2-3-11-10(4-8)12(17-16-11)5-9-6-13(18)15-14(19)7-9/h8-9,15-16H,2-7H2,1H3
charge 0 multiplicity 1
38 atoms
O  4.761319 0.519402 1.529775
O  1.511303 2.357752 -1.206276
N  -2.173864 -2.521614 -0.202531
N  -0.834217 -2.663126 0.153288
N  3.135473 1.36477 0.112586
C  -2.913806 1.619574 -0.068182
C  -1.625071 1.032813 0.58273
C  -1.52904 -0.455815 0.337517
C  -4.14454 0.717724 0.227389
C  1.989935 -1.200589 -0.274123
C  -4.005326 -0.698086 -0.398149
C  -2.625547 -1.217541 -0.100632
C  0.978533 -1.134861 0.912597
C  -0.446244 -1.386835 0.484724
C  3.455847 -1.103282 0.212769
C  1.726247 -0.095615 -1.325919
C  -3.154917 3.068934 0.401421
C  3.852037 0.28919 0.690408
C  2.082067 1.299253 -0.828065
H  -2.760658 1.627909 -1.168787
H  -1.647756 1.242872 1.673459
H  -0.743363 1.567887 0.179991
H  -5.061558 1.200821 -0.160954
H  -4.265399 0.624903 1.325821
H  1.845609 -2.18223 -0.761828
H  -4.168186 -0.634755 -1.493905
H  -4.788904 -1.371883 0.001603
H  1.045597 -0.151613 1.416656
H  1.276584 -1.898448 1.655688
H  4.147146 -1.374314 -0.611426
H  3.662747 -1.80239 1.041086
H  0.669107 -0.078341 -1.638154
H  2.3284 -0.286801 -2.237667
H  -2.270107 3.702425 0.205512
H  -4.018773 3.522913 -0.11877
H  -3.359717 3.100918 1.489266
H  -2.692169 -3.351569 -0.481743
H  3.396913 2.305451 0.43513
