program: Gaussian 09
title: 000278279
version: EM64L-G09RevD.01
frameworkgroup: C1[X(C10H8O4)]
method: RPBEPBE
basis: SDD
operation: Freq
keyword: #pfreq=noraman
keyword: PBEPBE/SDD
title: #p freq=noraman PBEPBE/SDD
converged: YES YES NO NO
title: Mulliken charges:
elementType: O O O O C C C C C C C C C C H H H H H H H H
charge: -0.207550 -0.263126 -0.263922 -0.211483 0.417585 0.321630 -0.677629 -0.465040 0.200987 0.189694 -0.548965 -0.533676 0.227304 -0.201852 0.249857 0.271375 0.251542 0.225915 0.269552 0.265287 0.241203 0.241312
chargesum: 0.00000
title: Mulliken charges with hydrogens summed into heavy atoms:
elementType: O O O O C C C C C C C C C C
charge: -0.207550 -0.263126 -0.263922 -0.211483 0.417585 0.321630 -0.156397 0.012417 0.200987 0.189694 -0.279413 -0.268389 0.227304 0.280663
polarizability: 1.69887516e+02 -3.69775735e+00 1.13934202e+02 4.31229259e+00 8.95393472e-02 6.45043655e+01
1716.lowfreq: -28.1300 -2.6081 -0.0005 -0.0003 0.0002 8.0186 11.3142 58.9411 116.2515
frequency: -27.7385 58.9385 116.2507 147.2047 204.3262 241.7360 277.7353 309.5081 359.5522 376.6031 417.9551 449.6010 486.4061 543.3103 579.0445 615.5844 680.4917 694.1500 714.1768 734.0464 765.7911 787.5377 823.2945 842.7614 861.4242 863.3292 936.1502 949.9738 975.7958 990.3207 1016.0270 1065.1714 1091.2656 1120.5410 1159.1937 1173.7443 1177.3352 1194.5658 1230.4716 1269.2518 1303.9360 1341.6803 1363.7579 1420.0793 1436.1032 1443.8847 1467.7877 1477.1408 1489.1681 1621.6337 1625.6457 1677.9858 2951.8089 2974.1144 3016.4724 3092.6988 3096.5948 3101.1742 3167.8127 3172.2265
redmass: 2.2961 8.1270 7.0468 6.5516 3.2697 5.5997 3.5833 3.7259 6.9377 6.6150 3.1557 5.9644 3.8820 6.1339 4.5675 5.8994 9.8900 6.9633 5.0701 5.3917 6.3802 5.3044 3.2411 7.6641 1.4264 1.4886 2.2043 9.4893 5.0957 1.9677 4.9358 1.4562 2.8604 1.0370 1.6157 3.1285 1.6012 1.1769 1.3076 1.6325 3.0120 1.6580 1.2929 4.0329 1.6028 2.4862 1.1572 1.8068 1.5116 7.7527 9.3979 11.5342 1.0689 1.0687 1.0537 1.0913 1.1189 1.0960 1.0933 1.0936
irintensity: 14.2646 5.8788 1.5545 1.0619 3.6199 0.0757 1.8178 1.8445 0.3069 4.4491 7.5826 3.0862 16.5837 3.4480 6.4134 1.0311 0.2950 1.6035 0.7050 16.2397 9.5085 3.9861 10.5242 34.6517 45.4378 4.6539 18.4630 94.2431 126.9205 8.0447 11.2777 4.6258 118.6510 0.0066 41.0212 26.7785 8.5994 59.7019 18.5047 72.0157 118.4664 42.4191 0.5128 4.3526 10.4043 11.9850 29.2352 114.8686 53.7036 6.8648 1.9031 349.3853 18.6749 39.3296 116.2193 5.7574 30.0815 9.5731 2.9468 0.9241
temp: 298.150 k
press: 1.00000 atm
elementType: 8 8 8 8 6 6 6 6 6 6 6 6 6 6 1 1 1 1 1 1 1 1
symmnumber: 1
zpe: 421936.5 jmol-1
zpe.correction: 0.160707 hartree
zpe.thermalcorrener: 0.170943 hartree
zpe.thermalcorrenthalpy: 0.171887 hartree
zpe.thermalcorrgfe: 0.124449 hartree
zpe.sumelectzpe: -685.730203 hartree
zpe.sumelectthermal: -685.719967 hartree
zpe.sumelectthermalent: -685.719023 hartree
zpe.sumelectthermalfe: -685.766461 hartree
dipole: -4.7395 0.7936 2.6748
dipole: 5.4997
quadrupole: -92.6571 -76.8954 -80.5813
quadrupole: 3.8395 12.0319 -0.3190
quadrupole: -9.2792 6.4825 2.7966 3.8395 12.0319 -0.3190
hfenergy: -685.89091 hartree
pointgroup: C01 [X(C10H8O4)]
dipole: 1.8591257 -0.2813732 1.0706737 debye
dipolederiv: -0.7087356 0.0680048 -0.0866563 0.5170804 -1.0687579 0.2218745 -0.0921426 -0.0431487 -0.3174795 -1.4419648 -0.1441797 0.1348252 -0.2422793 -0.4466732 0.0148481 0.1452457 0.0070158 -0.2668097 -1.4657657 0.0018941 0.1451843 0.0686354 -0.4120065 -0.010695 0.1648805 -0.0044725 -0.2690268 -0.9990213 0.3017088 -0.2442471 0.2839249 -0.642327 0.1018234 -0.4271003 0.1720008 -0.4869866 0.1874442 0.0048623 -0.019854 -0.2576817 -0.0035094 -0.0150778 -0.0770911 0.0276313 -0.0617309 -0.1495138 -0.0511565 -0.0237944 0.160844 -0.0935684 0.0191498 -0.0342259 0.0206331 -0.1087942 -0.2353779 -0.0662543 -0.1743289 -0.0817008 -0.0064795 -0.0778349 -0.158553 -0.1351902 0.0082196 0.6352554 -0.0715336 0.0565709 -0.0548491 0.3926238 -0.1063658 0.1142569 -0.0729385 0.3964737 0.9377523 0.2438554 -0.0901392 0.8321477 0.1469028 -0.0980861 -0.0675619 -0.0297891 0.0536901 1.044282 -0.1179889 -0.1213677 -0.6971407 -0.0252475 0.0814516 -0.1493693 0.0114662 0.0629649 -0.1899195 -0.0650475 -0.0244189 0.0462039 0.0680899 0.0089108 0.0230879 0.0201216 -0.1549124 -0.0677312 0.0673478 -0.01458 -0.0984653 0.0773063 0.0156368 -0.0402038 -0.0038543 -0.1542936 1.2521245 -0.2643506 0.448634 -0.5848655 1.3887101 -0.1715049 0.6019763 -0.0278419 0.4942625 1.2335706 0.0517333 -0.0936157 0.0573751 0.5267711 -0.0107421 -0.1126175 -0.0093104 0.5869158 -0.015823 0.022791 0.0557151 -0.0037981 0.1011902 0.0504281 0.0937475 -0.0048095 -0.047265 0.0448665 -0.0217311 -0.0112459 0.0212644 -0.0557145 0.0172654 -0.0228261 0.0489079 0.1072643 0.0559329 0.0765257 -0.0139055 0.0030747 -0.0825858 -0.0245473 -0.0163912 -0.0608017 0.073558 -0.1050652 -0.0313527 0.0564683 0.0329995 0.0663987 -0.010394 0.0269963 0.0896626 -0.1255072 0.0961713 0.0247317 0.0100788 0.0012509 -0.0289012 -0.0080952 -0.0009709 -0.0054448 0.1728863 0.0955154 -0.0058291 0.0079168 0.0211891 -0.034044 -0.0130455 0.0056498 -0.015778 0.1721078 -0.0685963 -0.0125249 0.0586838 -0.018256 0.0628618 0.0139499 0.1723226 0.021601 -0.1060726 -0.1354008 -0.011506 -0.0559236 -0.0069535 0.0689602 0.0010502 -0.1491098 -0.0056606 -0.0294645 unknown
polarizability: 169.9821165|-3.4454772|113.8709893|-3.5216699|-1.0733611|64.4729772 unknown
InChI: InChI=1S/C10H8O4/c11-10-3-6-1-8-9(14-5-13-8)2-7(6)4-12-10/h1-2H,3-5H2
charge 0 multiplicity 1
22 atoms
O  -2.901935 -1.006416 -0.388723
O  3.034562 1.35037 -0.093235
O  3.217487 -1.043308 -0.223567
O  -4.022242 0.933106 -0.862613
C  -0.611589 0.559866 0.344244
C  -0.502295 -0.851699 0.265617
C  -2.008111 1.124932 0.547926
C  -1.79049 -1.631595 0.396729
C  1.761905 0.748212 0.043978
C  1.868872 -0.657429 -0.031987
C  0.53447 1.390574 0.223833
C  0.751896 -1.48926 0.065832
C  -3.062843 0.387638 -0.288769
C  3.98964 0.226986 -0.303158
H  -2.310032 1.021654 1.613326
H  -2.073182 2.195203 0.29892
H  -1.710977 -2.651756 -0.007867
H  -2.129265 -1.691623 1.451455
H  0.462301 2.480409 0.266052
H  0.842717 -2.576055 -0.012222
H  4.432849 0.316016 -1.310166
H  4.742263 0.241177 0.502892
