program: Gaussian 09
title: 000278298
version: EM64L-G09RevD.01
frameworkgroup: C1[X(C15H20N4O2)]
method: RPBEPBE
basis: SDD
operation: Freq
keyword: #p
keyword: freq=noraman
keyword: PBEPBE/SDD
title: #p freq=noraman PBEPBE/SDD
converged: NO YES NO NO
title: Mulliken charges:
elementType: O O N N N N C C C C C C C C C C C C C C C H H H H H H H H H H H H H H H H H H H H
charge: -0.219822 -0.219150 -0.083075 -0.064530 -0.359179 -0.592862 -0.029322 -0.557350 -0.435006 0.164894 -0.102418 -0.535330 -0.494307 0.113514 0.040126 -0.520061 -0.522142 -0.750439 0.166428 0.155205 -0.101111 0.212658 0.220771 0.214122 0.210655 0.209352 0.235565 0.218988 0.248799 0.232830 0.244375 0.245144 0.292169 0.252875 0.250350 0.211277 0.212876 0.222839 0.347623 0.328434 0.334237
chargesum: 0.00000
title: Mulliken charges with hydrogens summed into heavy atoms:
elementType: O O N N N N C C C C C C C C C C C C C C C
charge: -0.219822 -0.219150 -0.083075 -0.064530 -0.011556 0.069809 0.183337 -0.122458 -0.014999 0.164894 0.133146 -0.067543 -0.017103 0.113514 0.040126 0.017252 -0.018917 -0.103447 0.166428 0.155205 -0.101111
polarizability: 2.18010913e+02 6.15697026e+00 2.31106082e+02 -1.29160534e+01 7.05425603e+00 1.26571926e+02
1716.lowfreq: -8.9049 -5.0615 0.0005 0.0008 0.0009 6.8201 16.0536 31.5092 44.4966
frequency: 15.1207 31.3848 44.4634 58.3035 80.7328 82.1412 115.6174 148.6960 173.9329 205.4567 210.2557 230.9900 245.8521 254.0503 300.8352 315.8902 326.7495 344.9885 367.5776 380.5523 421.8025 445.0003 468.9224 475.0003 489.9966 496.6334 513.6624 528.4218 533.2378 551.9384 562.7608 582.2941 605.0097 639.5157 663.9952 722.3546 765.2956 782.3204 797.7572 809.4758 823.8460 855.6545 860.2702 869.9868 888.8497 911.1135 922.3696 936.8421 939.4021 950.2661 987.6908 1000.4939 1030.6220 1061.9206 1077.3435 1089.2556 1095.0302 1100.1147 1136.7321 1150.6195 1154.4051 1165.1656 1191.5969 1220.2062 1222.5533 1250.7274 1254.9734 1272.1665 1278.3471 1289.7573 1301.4990 1302.2309 1315.7045 1318.4066 1330.1546 1335.4171 1347.6029 1351.0499 1357.0431 1370.8452 1374.1603 1385.3083 1390.5157 1431.9375 1443.2344 1446.1617 1452.8632 1466.8147 1473.5482 1475.4530 1477.8484 1478.0563 1521.8240 1553.1414 1607.2213 1640.5689 1644.0531 2936.4344 2954.7380 2966.8593 2974.7139 2976.1679 2982.3945 2987.7285 3001.0206 3005.3919 3008.9027 3036.4292 3050.9628 3060.3932 3065.1145 3068.7571 3075.1142 3080.1866 3481.8593 3557.9287 3717.1489
redmass: 5.8956 5.6289 4.6579 4.1342 5.2580 4.2500 3.1701 7.9170 3.3515 2.1086 1.3170 2.2720 3.5164 2.8980 2.5655 3.1475 3.5066 3.5897 4.0206 3.2851 2.0219 4.5477 1.3360 2.4416 3.8318 3.4213 4.7529 2.5928 1.2454 2.5409 4.8097 3.3380 4.0170 4.5383 5.3560 5.8038 3.4479 4.0798 1.4777 2.6961 3.1129 2.1383 2.1796 2.9849 1.7220 2.2279 2.7214 1.8735 2.8414 1.4739 3.1024 2.5418 1.9007 1.9192 2.3099 1.7707 1.9731 2.4930 1.2102 1.5062 1.5334 1.6807 2.6221 1.5948 1.4257 1.5915 1.4143 2.0944 2.0427 1.6385 1.4229 1.9621 2.1837 1.6025 1.5771 1.4513 1.4863 1.5759 1.7391 1.8446 4.5454 4.0038 1.2336 1.0895 1.0896 1.1705 1.1102 1.3726 1.8882 1.0793 1.0764 1.0773 5.6117 4.6086 1.6149 11.2284 5.4646 1.0668 1.0785 1.0371 1.0682 1.0608 1.0676 1.0672 1.0761 1.0839 1.0767 1.0987 1.0960 1.0991 1.1022 1.0991 1.0952 1.0941 1.0759 1.0441 1.1059
irintensity: 0.6274 0.5236 0.2580 0.0931 2.1842 0.7713 0.1410 7.0246 3.5099 2.6939 2.9597 0.3134 9.0975 1.4232 8.7593 0.5346 1.2363 10.2121 0.2208 13.1106 1.0570 10.9339 228.1472 57.4088 6.6310 0.9691 11.5310 5.5497 0.0988 4.6212 5.2519 4.7780 1.1910 1.0428 3.1493 6.2313 2.0484 4.1982 72.2124 31.4124 17.1032 10.1964 12.4200 1.8448 0.3171 0.0633 17.3905 1.6132 5.4801 3.3289 0.2475 0.5931 5.3251 8.8373 4.5326 9.4495 0.9457 0.4975 1.3307 55.5856 61.9120 1.5606 1.1032 38.4940 3.3063 5.5328 2.2709 105.7157 88.3453 3.8469 2.2260 23.3549 59.7475 5.9097 4.9485 3.6897 7.4220 11.0633 10.6003 4.9139 53.7860 38.3876 8.6023 11.0857 19.3951 31.0161 6.4825 50.0828 43.1731 8.2515 3.9170 17.1754 191.0412 156.4760 492.4367 150.1804 457.6032 18.6091 18.7661 29.7786 9.5219 62.0566 25.6084 14.6041 16.7063 31.9893 29.6876 39.0885 15.3211 57.5539 14.4818 44.5277 15.2724 0.3983 36.2188 113.1435 46.6081
temp: 298.150 k
press: 1.00000 atm
elementType: 8 8 7 7 7 7 6 6 6 6 6 6 6 6 6 6 6 6 6 6 6 1 1 1 1 1 1 1 1 1 1 1 1 1 1 1 1 1 1 1 1
symmnumber: 1
zpe: 887379.2 jmol-1
zpe.correction: 0.337985 hartree
zpe.thermalcorrener: 0.357292 hartree
zpe.thermalcorrenthalpy: 0.358236 hartree
zpe.thermalcorrgfe: 0.288950 hartree
zpe.sumelectzpe: -951.550425 hartree
zpe.sumelectthermal: -951.531118 hartree
zpe.sumelectthermalent: -951.530174 hartree
zpe.sumelectthermalfe: -951.599460 hartree
dipole: -4.0425 -1.2731 1.8601
dipole: 4.6284
quadrupole: -139.1108 -123.9770 -124.1445
quadrupole: 4.2044 4.5618 -7.7553
quadrupole: -10.0333 5.1004 4.9329 4.2044 4.5618 -7.7553
hfenergy: -951.8884098 hartree
pointgroup: C01 [X(C15H20N4O2)]
dipole: 1.5443944 -0.6216735 -0.7377405 debye
polarizability: 217.0193014|-5.1809741|231.9153584|-13.8611645|-6.3843579|126.7542611 unknown
InChI: InChI=1S/C15H20N4O2/c1-8-2-3-11-10(4-8)12(18-15(16)17-11)5-9-6-13(20)19-14(21)7-9/h8-9,19H,2-7,16H2,1H3
charge 0 multiplicity 1
41 atoms
O  -3.914533 2.223569 -0.603086
O  -4.621374 -2.006666 1.1448
N  0.199485 1.763438 0.481378
N  2.580513 2.090133 0.040142
N  -4.19063 0.08918 0.249526
N  1.117371 3.909784 0.278928
C  3.229162 -2.109895 -0.456523
C  1.879841 -1.684053 0.177259
C  4.366232 -1.2349 0.122021
C  1.664557 -0.174742 0.198742
C  -1.627674 -0.736049 -0.644845
C  -0.859064 -0.423745 0.680514
C  4.162074 0.248044 -0.249163
C  0.388223 0.410053 0.451209
C  2.747407 0.733622 0.010085
C  -2.258952 0.531043 -1.272386
C  -2.727138 -1.802398 -0.416542
C  3.490284 -3.614845 -0.243563
C  -3.491885 1.041004 -0.534432
C  -3.906546 -1.286002 0.400191
C  1.307377 2.547048 0.263692
H  3.17544 -1.911629 -1.548918
H  1.844011 -2.07757 1.216961
H  1.051938 -2.184425 -0.36317
H  5.346432 -1.583428 -0.255768
H  4.386843 -1.35143 1.225042
H  -0.899259 -1.147538 -1.370682
H  -0.595762 -1.380377 1.167485
H  -1.519659 0.132017 1.370562
H  4.383279 0.399927 -1.325745
H  4.85964 0.907625 0.297875
H  -2.564198 0.326693 -2.318757
H  -1.541721 1.367767 -1.297894
H  -2.337898 -2.696183 0.099702
H  -3.12834 -2.143181 -1.393046
H  3.594652 -3.846877 0.834155
H  2.662506 -4.231487 -0.642145
H  4.421173 -3.933015 -0.748227
H  -5.007652 0.442771 0.763879
H  1.913715 4.522634 0.128084
H  0.185628 4.278087 0.451161
