program: Gaussian 09
title: 000278295
version: EM64L-G09RevD.01
frameworkgroup: C1[X(C15H20N4O2)]
method: RPBEPBE
basis: SDD
operation: Freq
keyword: #p
keyword: freq=noraman
keyword: PBEPBE/SDD
title: #p freq=noraman PBEPBE/SDD
converged: YES YES NO NO
title: Mulliken charges:
elementType: O O N N N N C C C C C C C C C C C C C C C H H H H H H H H H H H H H H H H H H H H
charge: -0.219336 -0.220180 -0.068852 -0.083152 -0.358633 -0.593762 -0.144792 -0.103502 0.150468 -0.426069 -0.530836 -0.448606 -0.536668 0.067112 0.121683 -0.522357 -0.520179 -0.732649 0.155275 0.166177 -0.102326 0.238007 0.235992 0.205295 0.208811 0.215842 0.229005 0.207658 0.212067 0.248515 0.218591 0.250501 0.252931 0.292977 0.245291 0.212277 0.219179 0.248552 0.347695 0.334329 0.327672
chargesum: 0.00000
title: Mulliken charges with hydrogens summed into heavy atoms:
elementType: O O N N N N C C C C C C C C C C C C C C C
charge: -0.219336 -0.220180 -0.068852 -0.083152 -0.010938 0.068240 0.093214 0.132490 0.150468 -0.011963 -0.085989 -0.028882 -0.069563 0.067112 0.121683 -0.018925 0.018089 -0.052642 0.155275 0.166177 -0.102326
polarizability: 2.22839194e+02 1.25987567e-01 2.22541576e+02 1.45371185e+01 4.22060946e+00 1.29021562e+02
1716.lowfreq: -0.0009 -0.0004 0.0007 5.2570 8.2159 11.7212 24.9285 29.8913 41.3969
frequency: 24.4948 29.7131 41.3427 62.7208 84.2557 90.2513 117.1063 143.7855 148.7888 211.3386 225.5306 234.6030 259.4375 267.6347 295.1936 314.7462 334.2563 345.6496 356.2034 383.0443 428.1056 447.5254 470.2479 485.6008 486.9914 497.5820 514.8508 530.2612 534.5337 540.9357 582.8218 607.4967 624.2541 646.9592 694.1374 719.1317 737.3818 795.5219 802.0978 816.2774 828.1838 855.8114 858.7890 869.4502 877.8109 899.7840 912.4243 938.4276 941.8495 972.9093 984.8489 998.9785 1037.8254 1038.7728 1067.7827 1080.0742 1089.4703 1101.7665 1123.1702 1151.4451 1159.6005 1161.8721 1186.8275 1203.4726 1218.9061 1252.8593 1257.1849 1274.3996 1281.0219 1294.5660 1299.6808 1303.1297 1317.5669 1327.4532 1330.7751 1341.4048 1346.5921 1350.1687 1352.5105 1368.9395 1370.5206 1375.5234 1388.3594 1432.6097 1446.9615 1451.5800 1464.4074 1469.6077 1471.5617 1474.5084 1476.6995 1486.5496 1518.2067 1551.8692 1607.2392 1639.5718 1643.6857 2948.1666 2974.4166 2978.8370 2982.9184 2985.6073 2987.6361 3001.1178 3004.4791 3010.1550 3013.3367 3038.5283 3048.1146 3068.4295 3073.1948 3075.5852 3080.1179 3091.8850 3481.6255 3557.9572 3717.1124
redmass: 6.0786 4.7387 5.7340 4.1167 5.7204 3.6739 3.4339 3.5390 7.0094 1.1492 2.9231 2.9576 2.7236 3.2053 3.0878 2.9093 3.0908 3.8832 2.3293 3.1575 3.6298 4.1974 1.2293 3.5706 2.7005 4.2767 4.7410 2.7714 1.3225 2.2708 3.3399 3.2935 3.5918 5.0884 5.0492 5.4290 4.4761 1.6608 3.1870 2.6009 3.0854 1.8919 1.9471 2.8837 2.5273 2.4295 2.2348 2.7213 2.8673 1.7353 1.6650 2.6890 2.1671 1.8182 2.2449 2.2102 1.7826 1.8115 1.3114 1.4024 1.4631 1.5468 1.8041 1.9623 1.5747 1.6639 1.2598 2.3905 2.4884 1.7089 1.4170 2.0660 2.2130 1.4733 1.5993 1.4492 1.5155 1.5460 1.5468 1.8881 1.8162 4.2502 1.9123 1.0912 1.1016 1.1698 1.1882 1.4209 1.4812 1.0747 1.0987 1.1151 6.0311 4.5915 1.6052 10.5708 5.6249 1.0651 1.0616 1.0388 1.0679 1.0634 1.0670 1.0824 1.0705 1.0787 1.0841 1.0982 1.1034 1.1021 1.0998 1.0946 1.0940 1.0996 1.0759 1.0441 1.1059
irintensity: 0.6507 0.6513 0.0322 0.2369 2.7571 0.4540 0.0771 1.4822 9.2217 1.0330 1.6572 6.9621 2.4377 2.4521 1.0979 9.8486 0.4853 13.2360 2.2471 9.0430 3.2940 8.9933 276.3892 7.2283 3.4709 1.2615 10.6690 4.7943 3.0434 7.8174 4.2812 3.6045 2.4973 0.3332 1.4017 3.1622 8.2571 41.9356 51.5734 27.6480 4.2083 11.6711 0.5925 2.8542 6.6677 12.3343 0.4057 8.4945 3.1462 1.1923 2.4866 3.7844 6.7631 11.6859 10.4733 4.2335 8.6247 0.5839 7.7430 98.9384 4.2342 6.7775 7.7073 1.0385 36.9867 2.5836 1.3811 137.0730 61.1863 8.8204 2.7594 12.4260 63.9997 11.3021 5.9273 0.9236 4.0726 3.9266 31.8295 19.8103 24.1911 17.3249 22.4486 10.8567 18.9478 5.1164 27.1317 48.7886 14.2978 15.8331 3.2729 18.3465 222.6480 150.4875 479.7433 169.1779 437.7464 29.7279 31.9188 24.2172 27.9982 33.5408 11.3498 27.6352 2.6976 42.8700 33.6440 57.6386 56.4059 12.0566 51.3083 14.6955 0.4980 20.0575 36.3789 108.3798 45.8312
temp: 298.150 k
press: 1.00000 atm
elementType: 8 8 7 7 7 7 6 6 6 6 6 6 6 6 6 6 6 6 6 6 6 1 1 1 1 1 1 1 1 1 1 1 1 1 1 1 1 1 1 1 1
symmnumber: 1
zpe: 888705.7 jmol-1
zpe.correction: 0.338490 hartree
zpe.thermalcorrener: 0.357684 hartree
zpe.thermalcorrenthalpy: 0.358628 hartree
zpe.thermalcorrgfe: 0.290024 hartree
zpe.sumelectzpe: -951.548276 hartree
zpe.sumelectthermal: -951.529082 hartree
zpe.sumelectthermalent: -951.528138 hartree
zpe.sumelectthermalfe: -951.596742 hartree
dipole: 3.8920 -1.6196 1.6650
dipole: 4.5324
quadrupole: -140.9441 -122.3345 -123.8437
quadrupole: -2.3424 -5.6970 -6.6599
quadrupole: -11.9034 6.7063 5.1971 -2.3424 -5.6970 -6.6599
hfenergy: -951.8867658 hartree
pointgroup: C01 [X(C15H20N4O2)]
dipole: 1.4952833 0.7096852 -0.6634938 debye
polarizability: 222.3720708|0.2808151|222.3378538|-16.1291265|5.608147|129.6924079 unknown
InChI: InChI=1S/C15H20N4O2/c1-8-3-2-4-10-11(17-15(16)19-14(8)10)5-9-6-12(20)18-13(21)7-9/h8-9,18H,2-7,16H2,1H3
charge 0 multiplicity 1
41 atoms
O  -4.911979 1.726445 1.021581
O  -3.71079 -2.426972 -0.636706
N  2.709364 -1.598683 0.211694
N  0.294228 -1.522076 0.558271
N  -4.235139 -0.323301 0.174056
N  1.437839 -3.5619 0.410491
C  4.121621 0.380028 -0.028852
C  -1.745012 0.755157 -0.654322
C  1.560902 0.558358 0.322855
C  4.14258 1.887221 0.331264
C  1.612058 2.081946 0.30661
C  2.933791 2.629448 -0.278847
C  -0.993955 0.541118 0.700696
C  2.739882 -0.231185 0.180028
C  0.342333 -0.157187 0.526187
C  -2.95728 1.703635 -0.476899
C  -2.220654 -0.579159 -1.28121
C  4.609735 0.110008 -1.479938
C  -4.101588 1.075626 0.31101
C  -3.417167 -1.205357 -0.574457
C  1.485869 -2.186436 0.390639
H  4.807616 -0.166841 0.647223
H  -1.039976 1.232023 -1.362932
H  5.091702 2.333501 -0.02163
H  4.119534 2.008603 1.43329
H  0.755805 2.490114 -0.264845
H  1.493347 2.461166 1.344249
H  2.936231 2.504929 -1.379352
H  3.005694 3.715257 -0.080109
H  -1.616798 -0.074432 1.37487
H  -0.852342 1.525169 1.182699
H  -3.35977 1.988762 -1.470478
H  -2.681743 2.639975 0.03757
H  -1.419275 -1.336018 -1.269361
H  -2.509885 -0.421738 -2.340067
H  3.996998 0.653645 -2.222501
H  5.659943 0.435221 -1.596641
H  4.548335 -0.968191 -1.706108
H  -5.02644 -0.754444 0.669062
H  0.543105 -4.024096 0.549483
H  2.298279 -4.089736 0.29443
