program: Gaussian 09
title: 000278289
version: EM64L-G09RevD.01
frameworkgroup: C1[X(C12H14N2O3S)]
method: RPBEPBE
basis: SDD
operation: Freq
keyword: #p
keyword: freq=noraman
keyword: PBEPBE/SDD
title: #p freq=noraman PBEPBE/SDD
converged: YES YES NO NO
title: Mulliken charges:
elementType: S O O O N N C C C C C C C C C C C C H H H H H H H H H H H H H H
charge: -0.051110 -0.235214 -0.202555 -0.209096 -0.033871 0.018617 -0.374958 -0.357456 -0.300190 -0.301732 -0.236899 -0.613067 0.557210 -0.575908 -0.369012 0.381943 -0.183415 -0.384348 0.245443 0.244601 0.235462 0.260669 0.232695 0.196423 0.208172 0.231833 0.289007 0.230123 0.289292 0.274816 0.242765 0.289758
chargesum: 0.00000
title: Mulliken charges with hydrogens summed into heavy atoms:
elementType: S O O O N N C C C C C C C C C C C C
charge: -0.051110 -0.235214 -0.202555 -0.209096 -0.033871 0.018617 0.115087 0.138675 0.128928 0.138273 -0.236899 -0.093937 0.557210 -0.286616 -0.094196 0.381943 0.059350 -0.094590
polarizability: 2.07234156e+02 2.42301718e+01 1.85208841e+02 -1.05326374e+01 1.29733990e+01 1.25269216e+02
1716.lowfreq: -8.0251 -0.0014 0.0016 0.0017 6.6456 11.2494 15.7938 29.6409 51.6328
frequency: 14.6985 29.3139 51.4795 57.7149 59.5339 101.5680 148.4853 162.3214 174.9416 203.6112 278.3023 292.5729 300.5174 369.0775 385.2561 396.8477 416.9697 422.8939 456.8787 462.9432 488.1661 504.9747 521.7875 586.6304 616.2300 655.4646 671.0120 701.6136 723.7815 760.3733 794.7555 823.7854 824.8316 829.6184 880.3846 901.8360 916.1431 958.0313 964.2414 989.1626 1007.7045 1009.6241 1023.3868 1045.2632 1069.6515 1085.3996 1088.5783 1098.4762 1109.6149 1157.6986 1177.8392 1188.4476 1198.9882 1202.8286 1222.7843 1251.8850 1259.4185 1275.7533 1290.0452 1306.8981 1327.1717 1342.1149 1347.6829 1369.8190 1370.3904 1398.3346 1436.0176 1442.7624 1446.0686 1449.6267 1457.6551 1467.0043 1475.1934 1489.0598 1587.9967 1615.3713 2951.4095 2965.1534 2989.5812 2995.4671 3000.2526 3067.4140 3071.0950 3087.5065 3095.3284 3119.3744 3133.7889 3156.3037 3159.3639 3186.9593
redmass: 6.8108 6.2483 4.7326 7.1772 5.0807 5.7077 6.1074 6.4811 3.8020 3.4452 4.9730 3.3692 3.5278 3.4902 6.4576 2.5008 2.4884 3.0196 2.9008 4.3048 5.0582 4.5175 6.0667 2.7276 3.6608 7.0754 4.0530 2.5574 5.5529 6.7252 4.3001 1.7518 1.6193 2.4690 4.2559 2.4992 1.5876 1.7452 1.5755 6.1530 1.6101 1.9343 2.3000 2.2185 3.6545 1.6015 2.0248 2.7492 2.8472 1.5398 1.1598 1.1726 3.3370 1.7637 6.1028 1.3472 1.5647 1.2220 1.3319 1.3701 1.2507 1.2314 1.3516 1.3783 6.2391 7.1502 2.3832 1.4200 1.1878 1.0894 1.1002 1.4680 2.3691 1.4123 6.6640 6.8895 1.0683 1.0679 1.0614 1.0675 1.0652 1.1012 1.0962 1.0962 1.0982 1.0934 1.0902 1.0920 1.0932 1.0963
irintensity: 2.9953 0.5510 2.6107 1.5960 1.6267 1.9552 1.3025 1.6573 2.3541 2.6199 2.4162 16.9973 4.0128 0.3054 0.8099 3.0078 1.2473 0.4820 0.4505 0.2926 6.1425 9.9545 0.7197 10.0374 7.1896 9.7807 0.0898 44.0306 5.8703 19.3397 13.4791 22.3671 17.3439 1.5400 2.4274 4.2926 23.2919 4.9322 17.3818 0.3732 1.5728 6.1019 37.8883 38.4452 31.6962 19.5578 20.6513 33.9816 2.6089 43.9826 21.4554 9.6350 37.9890 26.5644 242.8768 50.0751 55.1537 17.9747 14.0418 8.4299 1.8749 1.4809 5.0610 12.0626 97.1019 0.9936 6.7151 89.5845 45.3281 2.8752 4.2758 89.2496 47.3372 38.3801 6.5838 8.1637 46.1484 49.9835 23.2452 48.2031 14.2116 16.3467 3.8847 25.0753 26.1086 12.8265 0.2874 4.2412 9.7401 2.6917
temp: 298.150 k
press: 1.00000 atm
elementType: 16 8 8 8 7 7 6 6 6 6 6 6 6 6 6 6 6 6 1 1 1 1 1 1 1 1 1 1 1 1 1 1
symmnumber: 1
zpe: 651787.2 jmol-1
zpe.correction: 0.248253 hartree
zpe.thermalcorrener: 0.264524 hartree
zpe.thermalcorrenthalpy: 0.265469 hartree
zpe.thermalcorrgfe: 0.201465 hartree
zpe.sumelectzpe: -1197.482083 hartree
zpe.sumelectthermal: -1197.465811 hartree
zpe.sumelectthermalent: -1197.464867 hartree
zpe.sumelectthermalfe: -1197.528870 hartree
dipole: 2.5821 0.2222 0.9318
dipole: 2.7541
quadrupole: -136.9314 -125.6647 -108.9046
quadrupole: -16.7705 -2.5612 6.6451
quadrupole: -13.0978 -1.8312 14.9290 -16.7705 -2.5612 6.6451
hfenergy: -1197.7303353 hartree
pointgroup: C01 [X(C12H14N2O3S1)]
dipole: -0.9027772 0.1547946 -0.5788858 debye
polarizability: 197.0567542|-24.5183991|182.2158442|5.0011048|-33.3282846|138.4396137 unknown
InChI: InChI=1S/C12H14N2O3S/c15-14(16)11-3-1-2-10(8-11)9-12(18)13-4-6-17-7-5-13/h1-3,8H,4-7,9H2
charge 0 multiplicity 1
32 atoms
S  -2.052019 3.203426 -0.502843
O  -4.268043 -1.61444 -0.435392
O  4.609331 -1.869368 1.023517
O  2.898416 -2.044682 2.520569
N  -2.265722 0.480773 -0.335559
N  3.457302 -1.512871 1.483527
C  -1.9577 -0.895683 0.132976
C  -3.318153 0.482715 -1.385608
C  -3.249819 -1.588783 0.621154
C  -4.576328 -0.238391 -0.867636
C  -1.667116 1.635404 0.105659
C  -0.572502 1.511433 1.173443
C  0.766797 1.011626 0.623187
C  1.477926 -0.012698 1.285563
C  1.333851 1.598637 -0.54052
C  2.727563 -0.429421 0.777164
C  2.586798 1.1683 -1.030798
C  3.302623 0.144384 -0.375553
H  -1.205723 -0.884443 0.933614
H  -1.538749 -1.466958 -0.718968
H  -2.923096 -0.04277 -2.277103
H  -3.535886 1.531464 -1.65129
H  -3.050313 -2.64383 0.870114
H  -3.643497 -1.06405 1.519024
H  -5.01833 0.332414 -0.023486
H  -5.322403 -0.342341 -1.671462
H  -0.439053 2.526998 1.581765
H  -0.898128 0.870723 2.015192
H  1.092672 -0.489391 2.192684
H  0.782976 2.396206 -1.052645
H  3.009386 1.635313 -1.926231
H  4.273837 -0.209294 -0.730856
