program: Gaussian 09
title: 000278288
version: EM64L-G09RevD.01
frameworkgroup: C1[X(C11H13NO4)]
method: RPBEPBE
basis: SDD
operation: Freq
keyword: #p
keyword: freq=noraman
keyword: PBEPBE/SDD
title: #p freq=noraman PBEPBE/SDD
converged: YES YES NO NO
title: Mulliken charges:
elementType: O O O O N C C C C C C C C C C C H H H H H H H H H H H H H
charge: -0.269289 -0.265130 -0.476647 -0.265909 -0.383079 -0.204911 0.491494 -0.435870 -0.502001 0.217319 0.159938 -0.422216 -0.332190 -0.204417 0.254676 -0.773755 0.258316 0.248305 0.260180 0.299879 0.250004 0.250096 0.306958 0.238297 0.230990 0.344679 0.256111 0.257395 0.210777
chargesum: 0.00000
title: Mulliken charges with hydrogens summed into heavy atoms:
elementType: O O O O N C C C C C C C C C C C
charge: -0.269289 -0.265130 -0.131968 -0.265909 -0.076121 0.053405 0.491494 0.072615 -0.202122 0.217319 0.159938 -0.172211 -0.082094 0.264870 0.254676 -0.049472
polarizability: 2.06376951e+02 2.56024490e+00 1.29485962e+02 -9.91646024e+00 -5.80761593e+00 8.02936540e+01
1716.lowfreq: -13.8898 -6.0294 -0.0004 -0.0002 0.0006 3.1609 21.8152 31.0164 54.1389
frequency: 21.4915 30.9625 54.0737 64.2279 73.5948 80.3613 107.7845 171.6350 187.2885 228.6114 240.1017 282.5543 290.0982 318.5250 360.9114 414.8322 425.2723 442.5575 499.5168 538.9289 550.4237 591.0180 605.7418 615.1867 651.7504 677.3652 723.0377 760.5144 781.0862 812.3701 827.1600 838.1946 877.2692 906.3753 920.9128 934.6281 974.5538 976.9035 1025.8450 1040.6709 1048.5700 1053.8780 1070.2165 1102.2460 1122.8313 1128.8600 1148.1458 1201.2704 1229.2112 1251.0452 1259.6307 1262.8350 1301.4113 1338.1427 1362.6732 1380.1727 1387.6646 1409.9269 1423.5404 1441.4961 1448.7589 1463.9143 1477.0191 1478.7371 1485.9803 1611.7075 1618.2271 1630.0815 2987.2629 2995.9439 2996.2737 3016.4642 3088.8078 3097.1593 3100.4303 3102.0355 3135.1932 3180.6980 3196.3161 3558.2889 3560.6662
redmass: 5.5393 4.9058 3.8154 4.4382 1.7887 1.5615 3.2632 6.1893 5.5840 5.5284 3.1842 1.3002 3.4146 4.6403 5.9214 3.2765 3.7373 3.2461 3.0624 3.5117 1.6921 5.5320 2.6507 2.9617 5.1639 8.9229 4.5540 5.0046 5.1288 1.5029 2.5889 8.7634 3.1819 1.5030 3.4401 1.3514 2.5964 2.6148 5.2094 1.6890 2.6003 3.1877 1.4981 3.6625 1.2850 1.2157 1.3769 1.3639 1.4832 1.9290 2.1218 1.5039 1.2009 1.2359 1.2980 2.2157 1.2335 2.2929 1.1537 4.6311 1.0463 1.1894 1.6238 1.7447 1.6245 8.0118 6.4257 8.2659 1.0847 1.0601 1.0366 1.0590 1.1054 1.0991 1.0995 1.1105 1.0903 1.0953 1.0930 1.0656 1.0785
irintensity: 1.1444 3.2048 6.4604 10.7799 3.1439 12.0642 1.7010 6.1967 2.9922 6.5791 36.2045 140.6142 4.8706 19.9331 2.2873 4.7317 9.7997 17.0055 4.1919 32.1358 38.4115 2.0733 22.8418 6.1393 4.6700 1.3116 2.4507 9.6353 8.4835 57.0098 0.2584 30.4695 8.1771 25.2059 29.0550 1.3406 107.2854 57.0100 30.4994 22.0032 13.8240 28.5142 7.3423 8.5230 17.5438 8.9226 28.2773 31.5411 62.4825 2.8514 236.7908 29.8495 8.0939 21.7904 3.7186 31.3097 73.3204 3.4208 32.5123 91.5413 16.9225 97.6928 168.9904 16.0361 46.4059 9.3291 141.1494 0.1458 11.8561 138.7723 7.1663 24.8433 7.6105 13.5963 14.5530 33.8321 7.2161 4.2162 2.2355 1.8954 18.1877
temp: 298.150 k
press: 1.00000 atm
elementType: 8 8 8 8 7 6 6 6 6 6 6 6 6 6 6 6 1 1 1 1 1 1 1 1 1 1 1 1 1
symmnumber: 1
zpe: 592618.5 jmol-1
zpe.correction: 0.225716 hartree
zpe.thermalcorrener: 0.241449 hartree
zpe.thermalcorrenthalpy: 0.242393 hartree
zpe.thermalcorrgfe: 0.180275 hartree
zpe.sumelectzpe: -781.403280 hartree
zpe.sumelectthermal: -781.387548 hartree
zpe.sumelectthermalent: -781.386604 hartree
zpe.sumelectthermalfe: -781.448722 hartree
dipole: 2.0195 -2.4255 1.7910
dipole: 3.6290
quadrupole: -71.1371 -97.7723 -94.0404
quadrupole: -12.9423 5.3291 -1.6205
quadrupole: 16.5128 -10.1224 -6.3905 -12.9423 5.3291 -1.6205
hfenergy: -781.6289968 hartree
pointgroup: C01 [X(C11H13N1O4)]
dipole: -0.8263904 -1.1286795 -0.2856881 debye
polarizability: 205.3629725|-7.8468288|127.2831282|-12.9257793|-11.7501017|83.5104658 unknown
InChI: InChI=1S/C11H13NO4/c1-7(13)12-5-9(14)8-2-3-10-11(4-8)16-6-15-10/h2-4,9,12,14H,5-6H2,1H3
charge 0 multiplicity 1
29 atoms
O  3.66956 -1.49972 0.139194
O  4.286662 0.656975 -0.714058
O  -1.251518 -1.337597 1.601925
O  -3.968849 1.489421 -0.045512
N  -3.423664 -0.750767 -0.308854
C  -1.190517 -0.17312 0.703725
C  0.26666 0.095909 0.364566
C  -2.005191 -0.461762 -0.591187
C  1.23411 -0.940675 0.49819
C  2.5417 -0.635346 0.12111
C  2.90642 0.632049 -0.380376
C  0.635679 1.369562 -0.135994
C  1.972675 1.660824 -0.522283
C  4.825903 -0.633926 -0.208534
C  -4.336432 0.2761 -0.087632
C  -5.78944 -0.151573 0.097218
H  -1.637375 0.714966 1.194729
H  -1.561586 -1.333587 -1.103354
H  -1.944541 0.418359 -1.255725
H  0.949674 -1.912341 0.905661
H  -0.121806 2.157975 -0.214575
H  2.259143 2.643163 -0.905711
H  -3.762496 -1.708291 -0.408897
H  5.40806 -1.116737 -1.008772
H  5.421245 -0.44233 0.704515
H  -2.19954 -1.472951 1.856442
H  -6.163353 0.23954 1.058811
H  -6.402215 0.305778 -0.698961
H  -5.935666 -1.245499 0.074342
