program: Gaussian 09
title: 000278293
version: EM64L-G09RevD.01
frameworkgroup: C1[X(C14H23NO4)]
method: RPBEPBE
basis: SDD
operation: Freq
keyword: #p
keyword: freq=noraman
keyword: PBEPBE/SDD
title: #p freq=noraman PBEPBE/SDD
converged: NO YES NO NO
title: Mulliken charges:
elementType: O O O O N C C C C C C C C C C C C C C H H H H H H H H H H H H H H H H H H H H H H H
charge: -0.447187 -0.435917 -0.217994 -0.215949 -0.351683 -0.138555 -0.173891 -0.087757 -0.446663 -0.114637 -0.441872 -0.424164 -0.524380 -0.023450 -0.748472 -0.526735 -0.544785 0.136403 0.131753 0.212297 0.240016 0.227587 0.246789 0.183665 0.256501 0.192259 0.213420 0.204431 0.211397 0.250543 0.211669 0.251812 0.216064 0.218976 0.223468 0.253824 0.244289 0.247951 0.290474 0.326878 0.320759 0.350866
chargesum: 0.00000
title: Mulliken charges with hydrogens summed into heavy atoms:
elementType: O O O O N C C C C C C C C C C C C C C
charge: -0.120309 -0.115159 -0.217994 -0.215949 -0.000817 0.073742 0.066125 0.139830 -0.016209 0.141863 -0.036193 -0.008335 -0.062169 0.228363 -0.089965 -0.028621 -0.006359 0.136403 0.131753
polarizability: 1.94808463e+02 -2.84521676e+00 1.68110916e+02 1.19902690e+00 -9.01346557e+00 1.30482920e+02
1716.lowfreq: -17.3748 -6.0792 0.0004 0.0007 0.0011 6.1894 18.1690 30.0015 50.1753
frequency: 14.9550 29.2541 50.0754 69.7450 96.8310 99.4430 115.6592 136.2380 143.3650 176.4515 191.3276 202.2031 225.7326 250.0420 265.3889 275.6917 287.8175 318.9799 338.8170 349.6685 375.4426 421.8742 423.9541 430.7972 451.9101 471.9746 489.3298 524.2340 540.6760 560.1133 589.5419 599.6424 638.1186 655.4432 748.7890 801.9212 813.7428 829.2202 848.9888 854.8126 867.2596 871.0600 889.2760 908.2968 915.3644 938.9594 957.5305 966.4466 988.0246 1004.5496 1042.3372 1051.6773 1064.4420 1074.1353 1079.1110 1084.4434 1112.7929 1127.0869 1136.8509 1143.0421 1158.9732 1168.7325 1185.2088 1203.3102 1227.2704 1240.8796 1248.3412 1259.7365 1272.0022 1283.2985 1288.0948 1299.8936 1312.7428 1315.1845 1317.1902 1320.5447 1325.6601 1332.4981 1336.0327 1343.7340 1352.0522 1359.3274 1360.1032 1365.1353 1372.1959 1373.3871 1389.9761 1439.5179 1445.8894 1455.5668 1462.5585 1470.6709 1477.5488 1480.6670 1487.0038 1637.8417 1641.3061 2929.1404 2946.7277 2947.8481 2948.9683 2971.4076 2975.6951 2976.4045 2980.7145 2988.4487 2999.1721 3024.0780 3025.0627 3038.4270 3038.6784 3051.3618 3056.5924 3068.5645 3070.0855 3075.0560 3083.2480 3483.1145 3531.1459 3560.4868
redmass: 5.1837 5.0986 5.0895 4.4630 2.6991 3.9445 5.2627 2.7740 7.8629 2.7556 1.7404 1.6234 4.1533 1.9401 1.4296 2.4147 3.9070 1.2342 3.3332 2.5656 2.5442 4.4082 2.5534 3.5137 2.3968 3.3507 2.7673 4.5308 2.8711 3.9442 3.3710 3.4017 3.3904 2.1128 2.8592 1.8297 1.6501 2.8245 1.9804 2.2535 1.6937 2.4523 2.6911 2.1382 2.8914 2.3693 2.3414 1.8103 2.0709 1.8015 2.3396 2.1979 1.5938 1.9764 2.0155 1.6876 2.1110 2.0092 1.8267 1.3156 1.4196 1.6721 1.5612 1.3921 1.4641 1.4929 1.3980 1.4908 1.8332 1.4272 1.5245 1.2708 1.2967 1.4934 3.2624 1.5605 1.5171 1.4973 1.4580 1.4706 1.1973 1.4749 1.4582 1.4811 1.6916 1.2674 1.2000 1.0862 1.0860 1.0848 1.0697 1.0834 1.0672 1.0764 1.0578 11.1674 5.4312 1.0798 1.0673 1.0645 1.0678 1.0687 1.0678 1.0402 1.0576 1.0840 1.0815 1.0929 1.0932 1.0956 1.0914 1.0933 1.0882 1.0988 1.0938 1.0988 1.0929 1.0759 1.0658 1.0653
irintensity: 0.1890 0.0288 0.6984 3.5847 0.4503 1.1772 2.7220 1.2779 6.2997 2.1510 2.1429 2.5584 0.6107 27.4682 92.5941 33.4652 2.6561 120.9252 3.0072 38.2643 6.0178 12.6040 14.3244 8.0435 6.0656 10.2136 0.5450 9.2700 3.8363 20.7967 6.8393 7.2460 3.3007 6.8189 8.1740 22.3640 116.8205 10.5776 10.4414 0.1061 1.7251 12.4082 16.3278 5.4789 4.4842 8.0888 25.8420 19.0910 9.1555 11.5214 39.1447 9.7080 31.1456 3.5324 7.9965 1.0970 3.6001 7.3182 6.2514 40.7852 28.4652 11.3138 11.8431 6.5902 22.0053 48.8391 15.2716 41.8324 161.8517 54.7506 7.1550 2.2219 7.5363 16.1803 76.2008 8.3069 10.1251 8.3791 0.5068 2.4845 29.1658 10.2248 5.1340 4.5869 11.1127 13.2191 25.8164 1.8817 6.4932 12.4781 6.0066 11.9852 19.8598 14.7601 4.8147 158.3712 466.3368 8.3584 13.6742 9.4961 76.0303 6.7819 2.9863 16.2570 45.4525 29.0759 9.4230 42.6364 34.8024 84.4274 3.7323 14.2667 36.9650 39.9941 15.7902 51.7741 4.3563 35.4461 4.1306 2.3898
temp: 298.150 k
press: 1.00000 atm
elementType: 8 8 8 8 7 6 6 6 6 6 6 6 6 6 6 6 6 6 6 1 1 1 1 1 1 1 1 1 1 1 1 1 1 1 1 1 1 1 1 1 1 1
symmnumber: 1
zpe: 937342.3 jmol-1
zpe.correction: 0.357015 hartree
zpe.thermalcorrener: 0.376669 hartree
zpe.thermalcorrenthalpy: 0.377613 hartree
zpe.thermalcorrgfe: 0.307942 hartree
zpe.sumelectzpe: -901.463439 hartree
zpe.sumelectthermal: -901.443784 hartree
zpe.sumelectthermalent: -901.442840 hartree
zpe.sumelectthermalfe: -901.512511 hartree
dipole: 6.6810 1.6472 -1.1033
dipole: 6.9689
quadrupole: -130.4634 -129.3860 -115.5171
quadrupole: -0.5151 -1.2782 -0.7655
quadrupole: -5.3412 -4.2638 9.6050 -0.5151 -1.2782 -0.7655
hfenergy: -901.8204534 hartree
pointgroup: C01 [X(C14H23N1O4)]
dipole: 2.6204939 -0.7255848 0.3520187 debye
polarizability: 194.8733253|2.5249217|169.3866083|-1.4807712|-5.3215789|129.1423662 unknown
InChI: InChI=1S/C14H23NO4/c1-8-3-2-4-10(14(8)19)11(16)5-9-6-12(17)15-13(18)7-9/h8-11,14-16,19H,2-7H2,1H3
charge 0 multiplicity 1
42 atoms
O  2.1284 0.185608 -1.985232
O  0.283504 1.029972 1.88775
O  -5.105297 -2.082428 0.305555
O  -4.262885 2.382391 -0.584706
N  -4.601319 0.140056 -0.118833
C  2.120571 0.065886 0.513847
C  2.519568 -0.637713 -0.814399
C  4.026007 -1.015428 -0.867884
C  3.03728 1.288676 0.785608
C  0.624605 0.479484 0.551434
C  4.92438 0.21237 -0.546072
C  4.532943 0.900439 0.783948
C  -0.35206 -0.648975 0.155322
C  -1.844854 -0.29768 0.364948
C  4.340334 -2.22541 0.046444
C  -2.737309 -1.497395 -0.031525
C  -2.264611 0.955299 -0.438742
C  -4.228049 -1.207729 0.077978
C  -3.75955 1.244745 -0.390814
H  2.282409 -0.676383 1.328768
H  1.923102 -1.556241 -0.954451
H  4.223738 -1.327551 -1.913657
H  2.746146 1.754803 1.743774
H  2.856379 2.061304 0.006166
H  0.482478 1.343947 -0.119756
H  4.85108 0.95598 -1.369454
H  5.98434 -0.106185 -0.522464
H  4.740526 0.222582 1.636058
H  5.158068 1.800058 0.940843
H  -0.186115 -0.888966 -0.913136
H  -0.111921 -1.565935 0.736509
H  -2.002581 -0.073553 1.438747
H  4.190603 -1.997156 1.117351
H  3.699308 -3.090957 -0.206197
H  5.392272 -2.539896 -0.080808
H  -2.532429 -2.386145 0.589929
H  -2.529814 -1.789599 -1.08256
H  -1.977553 0.839303 -1.504987
H  -1.757156 1.860244 -0.067058
H  2.692803 0.999722 -2.002894
H  0.426887 0.315651 2.561912
H  -5.608323 0.342506 -0.074361
