program: Gaussian 09
title: 000278281
version: EM64L-G09RevD.01
frameworkgroup: C1[X(C10H11NO4)]
method: RPBEPBE
basis: SDD
operation: Freq
keyword: #p
keyword: freq=noraman
keyword: PBEPBE/SDD
title: #p freq=noraman PBEPBE/SDD
converged: YES YES NO NO
title: Mulliken charges:
elementType: O O O O N C C C C C C C C C C H H H H H H H H H H H
charge: -0.268495 -0.263711 -0.462996 -0.297904 -0.599600 0.388017 0.284834 0.180891 0.178954 -0.502980 -0.508882 -0.738739 -0.441089 -0.203048 0.294762 0.246100 0.256253 0.210066 0.309528 0.229205 0.199269 0.241099 0.232909 0.374146 0.322186 0.339224
chargesum: 0.00000
title: Mulliken charges with hydrogens summed into heavy atoms:
elementType: O O O O N C C C C C C C C C C
charge: -0.268495 -0.263711 -0.088850 -0.297904 0.061810 0.388017 0.284834 0.180891 0.178954 -0.256880 -0.252629 -0.219145 -0.012614 0.270961 0.294762
polarizability: 1.66136843e+02 2.26582225e+00 1.35570388e+02 -8.16082505e+00 7.71792157e+00 7.93392022e+01
1716.lowfreq: -7.2539 -2.3874 -0.0003 0.0004 0.0008 4.7947 30.8227 55.9095 83.1759
frequency: 30.7709 55.8963 83.1584 86.3725 130.3358 174.3643 189.8484 235.9311 266.4628 274.2262 320.7620 360.5281 398.8454 416.6650 431.2669 475.7356 520.3300 537.0821 598.6305 624.1538 662.1585 675.7686 698.3562 711.2173 727.5130 774.4861 796.4732 811.8087 836.6955 842.2612 865.2149 884.2204 938.7159 972.0403 982.3410 996.2306 1034.3087 1062.8792 1070.3472 1125.2472 1142.5312 1157.4288 1181.1498 1219.0132 1238.3538 1262.7357 1299.1181 1336.2340 1360.0537 1365.2329 1402.6650 1409.3363 1423.5688 1444.2870 1466.5313 1475.4190 1486.8773 1585.8272 1623.5643 1625.0921 1636.2436 2933.2270 2998.8298 2999.3513 3005.2579 3073.1772 3108.6183 3154.0495 3157.5184 3192.4012 3519.2408 3674.1075
redmass: 4.1281 4.2288 2.4726 6.4050 3.6965 6.4900 8.2027 6.1670 4.7397 4.5420 6.8997 6.3765 3.0501 4.3586 3.0389 2.2562 1.7816 1.8188 2.7023 3.1398 3.3244 7.5796 3.2437 5.0782 4.2433 4.6680 1.1282 3.9183 7.0936 2.6867 1.4398 1.9315 2.0011 5.5189 3.1186 2.2187 6.4870 1.7772 1.4925 1.1221 2.3986 1.6433 1.5864 1.1914 1.4986 2.8904 1.3150 1.4739 1.4891 2.6723 1.2746 4.1008 3.0433 1.1100 1.3324 1.3703 1.5856 1.9346 7.2387 9.2174 2.1754 1.0658 1.0610 1.0943 1.0598 1.1025 1.1104 1.0922 1.0925 1.0710 1.0453 1.1040
irintensity: 8.9899 2.0517 22.3757 3.7457 8.4504 4.6785 6.9057 0.1939 13.2983 2.5585 3.0367 0.7136 3.2046 6.4434 3.9119 6.6643 48.0710 115.7302 50.7851 46.7554 29.6288 5.8279 41.7607 3.5976 7.1756 6.3966 305.3193 29.4869 17.8187 10.5854 15.4886 22.9116 8.6192 162.3917 16.2163 22.3623 32.9872 1.9615 7.8877 0.8405 4.5159 27.6040 26.9976 26.0599 61.5558 159.6178 4.9419 4.1259 22.7870 111.4307 85.2059 4.1655 3.0144 28.1182 63.4311 67.9733 72.9673 50.1789 8.1430 1.8394 298.7070 92.7859 129.6059 31.8773 31.7535 4.8921 31.1671 7.7230 1.2725 381.4858 41.2895 28.3971
temp: 298.150 k
press: 1.00000 atm
elementType: 8 8 8 8 7 6 6 6 6 6 6 6 6 6 6 1 1 1 1 1 1 1 1 1 1 1
symmnumber: 1
zpe: 524183.8 jmol-1
zpe.correction: 0.199651 hartree
zpe.thermalcorrener: 0.213120 hartree
zpe.thermalcorrenthalpy: 0.214065 hartree
zpe.thermalcorrgfe: 0.158648 hartree
zpe.sumelectzpe: -742.184970 hartree
zpe.sumelectthermal: -742.171501 hartree
zpe.sumelectthermalent: -742.170557 hartree
zpe.sumelectthermalfe: -742.225973 hartree
dipole: -1.5376 -4.7379 -1.0021
dipole: 5.0810
quadrupole: -85.9609 -78.0792 -88.2428
quadrupole: -15.4597 -6.2398 0.0484
quadrupole: -1.8666 6.0151 -4.1485 -15.4597 -6.2398 0.0484
hfenergy: -742.3846215 hartree
pointgroup: C01 [X(C10H11N1O4)]
dipole: 0.3434153 -1.7885535 0.8241352 debye
dipolederiv: -1.1729408 0.4278346 0.132859 0.5194647 -0.6401044 0.0169978 0.0557399 0.0592924 -0.3267064 -1.332218 0.3550282 0.185933 0.3088467 -0.5189141 -0.0062047 0.2023528 -0.0063116 -0.3177797 -0.8755132 -0.0432989 -0.0516613 -0.1329592 -0.7485186 0.1473752 -0.2069258 0.149965 -0.4566995 -0.5628735 -0.0383729 -0.1523813 -0.2558318 -0.8591936 0.1598105 -0.1922504 0.3680731 -0.8203619 -0.7896706 -0.2239705 0.27057 -0.3055468 -1.0269397 0.1980684 0.1338608 0.0532766 -0.3256036 0.2443967 0.0402434 -0.0200266 0.2089283 -0.0736049 -0.0687421 -0.1286449 -0.0434921 -0.1102508 -0.1728241 0.0039591 -0.029163 -0.1219556 0.0664557 0.0077913 -0.0046835 0.0362928 -0.0654731 0.5482087 -0.3596083 0.0352705 -0.8575616 0.4976924 0.0542436 0.2883076 -0.1192667 -0.0049026 1.1170165 -0.3099402 -0.182187 0.1452451 -0.0795974 -0.0163277 -0.399695 0.1345686 0.1179617 -0.1348286 0.0536175 -0.0790458 -0.0231896 -0.0303503 -0.0550589 -0.0312223 -0.0931957 -0.1065669 -0.1577659 0.0307704 -0.0390512 0.1199962 -0.0210478 -0.0903889 -0.0537588 -0.0711014 -0.1126939 -0.218841 -0.1108243 -0.0973453 -0.1464842 -0.0530088 -0.1188604 -0.1675096 -0.1211498 0.021543 0.7434141 0.0668056 0.0015339 0.0783801 0.3383089 -0.0316849 0.1100107 -0.1281144 0.3607894 1.0194715 -0.2519185 -0.118269 -0.3055718 0.6990001 0.0940717 -0.1562293 0.1085879 0.6123301 0.7065748 0.3889566 0.1697315 0.6697301 1.3063047 -0.3609939 0.3747948 -0.419677 0.866973 0.0809648 -0.0492995 0.0622291 -0.0367775 -0.0011959 0.0852486 0.0438718 0.0916478 0.1003253 0.0885183 -0.0195692 0.030487 -0.044177 0.0178124 0.0857268 0.0543866 0.088413 0.1083612 0.0219112 -0.0083897 -0.0115894 -0.0708755 -0.0164038 0.1651228 0.0304524 0.0808041 -0.0715531 0.0479373 -0.0019206 0.0104454 0.0615024 0.0956881 -0.0657317 -0.0232051 -0.0395828 0.1161807 -0.0031225 0.0372247 -0.0259557 0.0061467 -0.0692538 -0.0699404 -0.0521924 -0.1370325 -0.0404892 -0.0843812 -0.0999668 0.1059593 -0.027629 -0.0080474 0.0734011 0.0912506 0.1379751 -0.0957627 -0.1420221 0.0562835 -0.0465313 0.0300851 0.0588837 -0.0128375 -0.0973915 0.0072067 0.0264668 0.0080298 0.0114312 -0.0043511 0.0971689 -0.0503349 -0.0994689 0.1249339 -0.1476364 -0.1124644 0.3624131 0.1173706 0.0289435 0.1856617 0.6644354 -0.1485942 0.155044 -0.0677648 0.2760206 0.3341184 -0.0243644 -0.0950891 -0.0162235 0.2309786 0.028904 -0.0852937 0.0368557 0.1699272 0.3240264 -0.0480818 -0.0813151 -0.0863728 0.2209554 0.0280725 -0.0660037 0.0413665 0.1904289 unknown
polarizability: 163.4615673|-10.1514951|130.9456873|-11.9747413|-18.3356157|86.6391791 unknown
InChI: InChI=1S/C10H11NO4/c11-10(13)3-6-1-8-9(15-5-14-8)2-7(6)4-12/h1-2,12H,3-5,11H2
charge 0 multiplicity 1
26 atoms
O  2.531727 -1.76736 0.514802
O  3.3114 0.156546 -0.691623
O  -2.492016 2.505186 -0.418478
O  -3.252238 -0.001503 -1.075594
N  -3.53083 -1.808705 0.332866
C  -0.686061 0.224448 0.62911
C  -0.22415 1.372268 -0.080829
C  1.490342 -0.81288 0.374686
C  1.947252 0.316785 -0.332483
C  0.188279 -0.883045 0.860724
C  1.117934 1.408484 -0.573553
C  -2.127822 0.080874 1.121524
C  -1.048021 2.647536 -0.324172
C  3.638426 -1.249419 -0.335135
C  -3.011665 -0.568117 0.040816
H  -0.157577 -1.763981 1.410042
H  1.484069 2.278435 -1.127483
H  -2.150794 -0.522896 2.046526
H  -2.563658 1.072978 1.330036
H  -0.888643 3.350262 0.517577
H  -0.645471 3.139809 -1.2365
H  4.573248 -1.263848 0.245795
H  3.692552 -1.852894 -1.261023
H  -2.74382 1.673137 -0.933782
H  -3.347581 -2.274104 1.219252
H  -4.118082 -2.271396 -0.361801
