program: Gaussian 09
title: 000278278
version: EM64L-G09RevD.01
frameworkgroup: C1[X(C10H9BrO4)]
method: RPBEPBE
basis: SDD
operation: Freq
keyword: #p
keyword: freq=noraman
keyword: PBEPBE/SDD
title: #p freq=noraman PBEPBE/SDD
converged: YES YES NO NO
title: Mulliken charges:
elementType: Br O O O O C C C C C C C C C C H H H H H H H H H
charge: 0.005430 -0.262876 -0.258854 -0.262671 -0.220644 0.669791 0.199918 0.183925 -0.509702 -0.707422 -0.402326 -0.289014 -0.202977 0.276298 -0.503381 0.261892 0.283845 0.260378 0.274416 0.237631 0.244328 0.240894 0.234365 0.246758
chargesum: 0.00000
title: Mulliken charges with hydrogens summed into heavy atoms:
elementType: Br O O O O C C C C C C C C C C
charge: 0.005430 -0.262876 -0.258854 -0.262671 -0.220644 0.669791 0.199918 0.183925 -0.247811 -0.163199 -0.402326 -0.014599 0.278982 0.276298 0.218636
polarizability: 1.95697621e+02 -1.80609120e+01 1.27774591e+02 1.13973089e+01 9.17544312e+00 8.24105029e+01
1716.lowfreq: -5.5661 -0.0010 -0.0008 -0.0007 3.6733 8.4932 20.9779 28.1643 55.9642
frequency: 20.9553 28.1028 55.9600 83.3614 99.3471 108.0380 148.0303 174.2651 190.4401 226.3965 253.4271 265.9566 305.7543 331.5282 350.8168 428.7519 450.7899 544.1334 553.6355 604.0760 648.7132 677.5542 684.0379 713.2075 754.7247 793.9779 830.4273 840.1945 858.0653 885.1546 926.7550 930.3247 964.7750 980.3303 1069.1956 1071.5449 1113.1428 1120.6028 1128.7663 1148.6536 1161.8771 1180.6824 1238.5213 1256.9624 1314.1671 1359.1296 1380.9168 1415.4784 1421.4147 1445.8206 1452.9113 1463.8160 1465.2077 1483.8114 1606.4525 1625.1460 1655.2365 3004.5014 3004.9003 3007.8347 3072.3092 3107.1768 3116.8209 3150.4127 3171.7616 3194.3569
redmass: 5.5436 7.0028 5.3251 3.2658 1.0981 4.7402 4.4168 7.4847 6.5197 5.8283 5.0010 6.9214 3.9500 4.6228 8.6300 3.3166 3.3370 5.8443 3.9543 8.2546 7.2123 9.2723 6.4667 4.3504 5.8002 5.8669 4.6881 4.4207 1.4883 1.8335 5.9612 2.1591 6.2693 3.9487 2.8207 1.7870 1.2743 3.2515 1.0680 1.4365 1.9958 1.2878 1.3485 4.2156 1.7734 1.3784 3.3134 6.3997 1.1838 1.1400 1.0500 1.0543 2.4253 1.3333 8.5927 9.2164 9.1272 1.0546 1.0371 1.0611 1.0972 1.1046 1.1107 1.1048 1.0932 1.0938
irintensity: 0.7042 1.2659 2.2416 8.2893 0.2683 4.8706 3.9490 1.9562 1.1315 4.5754 7.8853 3.6233 2.6623 13.9813 1.3936 8.9153 8.5871 9.7690 7.2682 5.7426 17.2322 1.3604 7.0515 3.7358 4.0507 17.5681 23.5572 14.7517 15.3931 34.7226 18.2783 5.6403 128.9580 44.0427 33.9373 20.5040 3.2471 374.8371 2.8617 9.3474 5.9850 17.7087 19.2367 172.2484 40.1134 2.5595 43.4777 10.9708 21.4498 28.4296 13.9797 20.6794 183.3016 40.6535 2.5075 4.4285 145.1961 123.8613 32.3765 7.4641 1.2808 24.2586 27.4520 16.6690 2.0090 0.8094
temp: 298.150 k
press: 1.00000 atm
elementType: 35 8 8 8 8 6 6 6 6 6 6 6 6 6 6 1 1 1 1 1 1 1 1 1
symmnumber: 1
zpe: 449326.6 jmol-1
zpe.correction: 0.171139 hartree
zpe.thermalcorrener: 0.185709 hartree
zpe.thermalcorrenthalpy: 0.186654 hartree
zpe.thermalcorrgfe: 0.126370 hartree
zpe.sumelectzpe: -699.687628 hartree
zpe.sumelectthermal: -699.673058 hartree
zpe.sumelectthermalent: -699.672114 hartree
zpe.sumelectthermalfe: -699.732397 hartree
dipole: 0.1634 -1.3194 -0.7234
dipole: 1.5135
quadrupole: -72.7992 -95.5008 -98.2486
quadrupole: 1.2502 1.8022 2.5604
quadrupole: 16.0503 -6.6513 -9.3990 1.2502 1.8022 2.5604
hfenergy: -699.8587676 hartree
pointgroup: C01 [X(C10H9Br1O4)]
dipole: -0.0023037 -0.5189431 -0.2919938 debye
dipolederiv: -0.3075258 0.2749754 0.0195093 0.2894603 -0.4057061 -0.0355554 0.0263205 -0.0466599 -0.038039 -1.280267 0.4110096 -0.1579753 0.4659711 -0.6035655 -0.0001428 -0.0963438 -0.0289997 -0.3093036 -1.4081812 0.3005929 -0.1956231 0.2155253 -0.4961639 0.0103195 -0.1991496 0.0169146 -0.3003639 -1.6175866 -0.0714267 0.009366 0.0196399 -0.3025323 0.0530595 0.0314726 0.0827005 -0.4768613 -0.745873 -0.0497555 0.0158047 0.0799534 -0.3377144 0.1582099 -0.2193325 0.1900716 -0.7611707 0.0477697 0.1874223 -0.0001168 0.1934389 -0.2004725 0.0075479 0.0471855 -0.0405774 -0.0476512 0.660217 -0.4032462 0.0026612 -0.9187592 0.4472603 -0.0935575 -0.1839263 0.0351678 0.0188768 1.149912 -0.2015623 0.1795348 0.2706481 -0.0758999 0.0473691 0.3198093 -0.0643044 0.0948658 -0.0742423 0.0248686 0.0553807 0.0042799 0.0185761 0.0475741 0.0137352 0.0375611 -0.1258286 -0.1038064 0.0155503 0.1172011 0.0361905 0.1296013 0.0220806 0.2517553 0.104354 -0.130581 0.3840435 -0.4703675 -0.0116982 -0.5679416 0.6644332 0.092331 -0.0737432 0.1588177 -0.1130566 -0.2526562 0.0601875 -0.0007526 0.2299426 -0.1313933 0.0410566 0.0404221 -0.0031672 -0.0805532 1.0849882 -0.2292052 0.1484635 -0.2527896 0.6441807 -0.0786276 0.2054276 -0.1025968 0.6297102 1.8273584 0.0678102 -0.0119205 -0.1557401 0.2845244 -0.2248931 0.138882 -0.3045549 0.9664127 0.5733064 0.0336004 -0.0927129 0.085288 0.2692606 -0.0002064 -0.2406373 -0.0221816 0.278031 0.0877181 -0.0237783 -0.040075 -0.0202975 -0.0153478 -0.0566534 -0.0352075 -0.0544706 0.1390326 0.0026131 0.0163174 -0.0301604 0.032063 0.0351166 0.0870408 -0.024397 0.0338118 0.0872728 0.0519819 0.006075 0.040798 -0.0526027 -0.0327756 -0.0987375 -0.0064159 -0.0544271 0.0563513 0.0973881 -0.0229312 -0.0237238 -0.0266156 0.0339657 -0.0485142 -0.0336431 -0.0508765 0.1555856 0.0002046 0.0185534 -0.0060183 0.075659 -0.0016877 0.0741686 -0.1517245 0.1196242 -0.1370456 -0.1342317 0.0505133 0.0403836 0.0313123 0.0661998 0.0083984 0.0925903 -0.0070839 0.0261308 0.0339969 0.0407397 0.0149504 -0.0491219 -0.1021772 0.0608869 0.0961514 0.0550494 0.0569908 -0.1099917 0.0152869 -0.0501385 0.0373646 0.110533 0.0234887 -0.0868833 0.0265716 0.0511341 0.0328642 -0.0512303 -0.0231378 -0.0228689 0.0017844 -0.0966437 0.087652 -0.0807443 -0.0399397 unknown
polarizability: 190.8809973|-25.5541652|132.7288598|10.2490227|8.9027986|82.2728574 unknown
InChI: InChI=1S/C10H9BrO4/c1-13-10(12)3-6-2-8-9(4-7(6)11)15-5-14-8/h2,4H,3,5H2,1H3
charge 0 multiplicity 1
24 atoms
Br -1.177955 2.752036 0.001074
O  3.062592 -1.658667 -0.370862
O  3.72234 0.491995 0.464485
O  -4.007524 -0.344913 -0.318845
O  -2.366272 -0.905697 1.237372
C  -0.314795 0.016654 -0.6639
C  1.951577 -0.779677 -0.336736
C  2.34123 0.483657 0.154734
C  0.64679 -1.035046 -0.752762
C  -1.74444 -0.25148 -1.088191
C  0.109134 1.273496 -0.163075
C  1.439308 1.543105 0.253583
C  4.147611 -0.930263 0.339953
C  -2.683736 -0.532688 0.089072
C  -5.038967 -0.617759 0.712605
H  0.355695 -2.019153 -1.129396
H  -2.17093 0.587695 -1.663865
H  -1.784764 -1.138454 -1.748531
H  1.739507 2.522196 0.630739
H  4.266223 -1.358953 1.352757
H  5.066627 -0.976981 -0.263068
H  -4.97262 -1.664918 1.052968
H  -5.996277 -0.422528 0.20989
H  -4.897551 0.053543 1.575999
