program: Gaussian 09
title: 000278305
version: EM64L-G09RevD.01
frameworkgroup: C1[X(C19H24N2O)]
method: RPBEPBE
basis: SDD
operation: Freq
keyword: #p
keyword: freq=noraman
keyword: PBEPBE/SDD
title: #p freq=noraman PBEPBE/SDD
converged: YES YES NO NO
title: Mulliken charges:
elementType: O N N C C C C C C C C C C C C C C C C C C C H H H H H H H H H H H H H H H H H H H H H H H H
charge: -0.459618 -0.090230 -0.177362 -0.366924 -0.359837 -0.407410 -0.384586 -0.387592 -0.062742 0.470819 -0.561324 0.472361 -0.377911 -0.381316 -0.379298 -0.453523 -0.234127 -0.225363 -0.267699 -0.232518 -0.221580 -0.247801 0.190964 0.209078 0.212942 0.189556 0.209239 0.218067 0.206882 0.214815 0.181618 0.219247 0.211504 0.220177 0.231540 0.232635 0.216378 0.335311 0.274571 0.230638 0.218567 0.219097 0.225742 0.221071 0.221347 0.224596
chargesum: 0.00000
title: Mulliken charges with hydrogens summed into heavy atoms:
elementType: O N N C C C C C C C C C C C C C C C C C C C
charge: -0.124308 -0.090230 -0.177362 0.033118 0.042661 0.019896 0.037111 0.013273 0.148762 0.470819 -0.109607 0.472361 -0.145276 -0.164938 -0.104727 -0.222886 -0.015560 -0.006266 -0.041957 -0.011448 -0.000232 -0.023206
polarizability: 3.01510104e+02 1.36563503e+01 2.17322731e+02 -2.13882102e+01 1.40201784e+01 1.45235317e+02
1716.lowfreq: -8.4041 -3.2063 -0.0005 0.0004 0.0006 3.1885 16.8651 18.6757 21.6218
frequency: 16.5065 18.3490 21.3901 39.2426 56.0758 60.5984 82.5208 99.5170 144.4174 160.7452 215.8611 233.5033 245.0964 261.0326 275.9389 293.0654 296.5645 323.3779 378.1563 384.1041 404.0865 409.0950 412.3782 432.8409 447.8214 473.1016 500.9781 516.8707 551.0734 598.1275 614.1544 617.5109 626.3223 691.3727 705.5617 717.9278 749.9394 756.2683 780.1978 805.9378 816.2860 840.1369 843.6308 856.1889 874.1691 888.5204 917.8612 922.6601 949.4924 955.7464 975.7908 977.2299 978.2640 989.8023 994.3071 998.1105 1004.8246 1027.8580 1031.9698 1046.0524 1051.7000 1061.0410 1074.6303 1081.3365 1089.3195 1094.3400 1142.3757 1147.0407 1162.9253 1170.3352 1170.8485 1175.3454 1187.2566 1200.5469 1204.5971 1215.1102 1231.2325 1239.4311 1254.7378 1281.0705 1297.8473 1298.8574 1313.4959 1325.2002 1330.6049 1342.3958 1345.3289 1359.0506 1363.8463 1372.4513 1375.8468 1381.4050 1385.6370 1393.6876 1437.8657 1445.9197 1449.9224 1455.7927 1457.9682 1462.6129 1465.3269 1471.8395 1483.5401 1495.2733 1579.2099 1591.3081 1613.9928 1617.8497 2831.3845 2856.0934 2867.8081 2905.7759 2918.6801 2960.1383 2985.2752 3030.2662 3037.7472 3044.7958 3054.8171 3058.5225 3092.8427 3111.9102 3121.3183 3121.8774 3127.8236 3135.4620 3148.5246 3151.5966 3157.5282 3163.3436 3168.8278 3550.8873
redmass: 5.5377 3.4400 3.8026 4.4219 3.1342 4.1009 4.7885 4.4722 4.3092 3.6963 3.1675 4.1035 2.0276 2.9683 1.3687 2.9216 3.3274 2.0427 3.1072 2.7226 2.8216 2.8601 2.5566 2.9464 3.1354 2.7782 3.1270 2.8885 5.1871 4.0138 6.2171 6.2275 2.2591 1.7961 1.8339 3.9620 1.9032 1.8896 3.3809 2.8546 1.3089 2.9039 1.5795 1.2460 1.4937 1.9542 2.5682 1.7854 2.1799 1.3818 1.3017 1.3989 5.3493 4.8699 1.3796 2.7363 2.5504 2.1978 2.1558 1.8836 1.8608 2.3318 2.3985 1.6441 1.7252 2.1398 2.5437 2.8821 1.1756 1.1072 1.1209 1.6200 1.1191 1.1441 1.1205 2.3453 1.6661 1.4807 1.2493 1.3936 1.2334 1.3880 1.4203 1.3637 1.2926 1.3568 1.4060 1.7721 1.4538 1.6580 1.7600 5.9777 2.8947 1.4749 1.9494 2.3932 1.0999 1.1027 1.1103 1.1435 1.1231 1.1118 2.3110 2.3633 5.9339 6.0187 6.1229 6.0515 1.0707 1.0709 1.0695 1.0694 1.0710 1.0830 1.0624 1.0888 1.0888 1.0895 1.0993 1.0897 1.0891 1.0862 1.0843 1.0870 1.0883 1.0931 1.0922 1.0960 1.0941 1.0998 1.0996 1.0659
irintensity: 0.1372 0.0287 0.2036 0.3436 1.8098 0.6898 1.3862 1.2203 2.0270 2.1135 1.4253 2.0766 2.3567 13.8304 115.8783 13.6661 4.8405 9.1759 7.2359 4.1839 0.1664 0.6511 7.2924 10.3138 6.3773 0.6919 18.1379 15.6975 1.5372 7.0954 0.5064 0.4292 3.5839 41.8398 51.6372 5.2666 48.3600 76.0001 6.3044 4.9954 1.3524 13.1216 0.6559 0.2924 4.9042 14.2123 17.9658 18.5661 6.2544 0.1932 0.4369 0.7169 7.3886 1.3008 1.3332 49.1019 53.2023 9.2835 11.5763 35.4046 13.7567 4.0854 11.9743 13.5899 3.8898 15.4182 50.9208 41.3834 8.0336 1.7637 0.9486 9.8086 0.2908 0.6460 4.3050 2.7615 20.0412 179.2867 17.8821 33.3239 2.7091 32.1003 5.3987 3.6818 4.7486 2.7575 4.9884 20.3744 1.1149 36.9129 28.8986 0.9612 25.1714 1.6833 8.2546 0.8978 4.1242 9.4367 4.1758 5.6601 71.3791 4.9199 25.3538 131.9535 10.0962 0.6734 15.2917 162.4131 78.6314 55.3795 144.6758 67.3935 109.0895 26.7944 22.2062 7.6372 64.3335 45.9700 9.4938 25.0321 21.7743 9.3635 9.4978 1.6141 8.2456 38.0747 38.6824 28.7953 42.2011 16.3828 6.3212 6.9836
temp: 298.150 k
press: 1.00000 atm
elementType: 8 7 7 6 6 6 6 6 6 6 6 6 6 6 6 6 6 6 6 6 6 6 1 1 1 1 1 1 1 1 1 1 1 1 1 1 1 1 1 1 1 1 1 1 1 1
symmnumber: 1
zpe: 1023160.5 jmol-1
zpe.correction: 0.389701 hartree
zpe.thermalcorrener: 0.410031 hartree
zpe.thermalcorrenthalpy: 0.410975 hartree
zpe.thermalcorrgfe: 0.337308 hartree
zpe.sumelectzpe: -921.484756 hartree
zpe.sumelectthermal: -921.464427 hartree
zpe.sumelectthermalent: -921.463482 hartree
zpe.sumelectthermalfe: -921.537149 hartree
dipole: 0.5756 -1.2100 1.1151
dipole: 1.7432
quadrupole: -146.0829 -123.4222 -129.5404
quadrupole: -2.2679 -8.6487 1.7225
quadrupole: -13.0677 9.5930 3.4747 -2.2679 -8.6487 1.7225
hfenergy: -921.8744576 hartree
pointgroup: C01 [X(C19H24N2O1)]
dipole: -0.2253884 -0.4931231 -0.4199855 debye
polarizability: 301.6020443|-14.4065694|216.0875068|-20.544555|-16.8565826|146.3786004 unknown
InChI: InChI=1S/C19H24N2O/c22-19(15-17-7-3-1-4-8-17)16-20-11-13-21(14-12-20)18-9-5-2-6-10-18/h1-10,19,22H,11-16H2
charge 0 multiplicity 1
46 atoms
O  3.568826 -2.527904 -0.718184
N  0.017366 -1.429593 0.048099
N  -2.691141 -0.404879 -0.08211
C  -0.537993 -0.888796 -1.21577
C  -1.068331 -2.051836 0.844118
C  -1.632078 0.158871 -0.939529
C  -2.154889 -1.011081 1.159294
C  1.179118 -2.322181 -0.156922
C  2.493651 -1.549197 -0.434823
C  -3.978123 0.194789 -0.074205
C  2.950519 -0.730841 0.786842
C  3.983697 0.342688 0.474338
C  -4.256705 1.386082 -0.811744
C  -5.058083 -0.403902 0.645823
C  5.285035 -0.004065 0.021273
C  3.664231 1.716714 0.626579
C  -5.556094 1.93722 -0.835403
C  -6.347251 0.16195 0.623189
C  -6.614919 1.337013 -0.119359
C  6.236419 0.997849 -0.272557
C  4.615097 2.722113 0.333669
C  5.906409 2.365295 -0.11724
H  -0.975316 -1.707699 -1.842853
H  0.269404 -0.408727 -1.797019
H  -0.64274 -2.42756 1.79281
H  -1.535287 -2.914181 0.30398
H  -1.166376 1.059681 -0.475032
H  -2.070907 0.457679 -1.907083
H  -2.965749 -1.495634 1.723905
H  -1.711646 -0.221292 1.808744
H  1.003575 -3.049334 -0.993579
H  1.332727 -2.920987 0.760795
H  2.365711 -0.87495 -1.308575
H  3.352595 -1.457494 1.520987
H  2.043265 -0.274265 1.223146
H  -3.458664 1.904503 -1.351022
H  -4.901055 -1.333536 1.202171
H  3.364506 -2.99962 -1.565686
H  5.532751 -1.062963 -0.105932
H  2.66432 1.999223 0.979871
H  -5.734139 2.853964 -1.410021
H  -7.153668 -0.328343 1.181316
H  -7.619985 1.770893 -0.136567
H  7.236832 0.713554 -0.619658
H  4.350584 3.77848 0.460192
H  6.646801 3.141698 -0.341865
