program: Gaussian 09
title: 000278306
version: EM64L-G09RevD.01
frameworkgroup: C1[X(C20H24N2O3)]
method: RPBEPBE
basis: SDD
operation: Freq
keyword: #p
keyword: freq=noraman
keyword: PBEPBE/SDD
title: #p freq=noraman PBEPBE/SDD
converged: YES YES NO NO
title: Mulliken charges:
elementType: O O O N N C C C C C C C C C C C C C C C C C C C C H H H H H H H H H H H H H H H H H H H H H H H H
charge: -0.299380 -0.281404 -0.277994 -0.184214 -0.138546 -0.415246 -0.382875 -0.363941 -0.412485 0.467979 0.243264 -0.514664 -0.508240 -0.401020 -0.311536 0.350835 -0.216540 -0.399702 0.378625 -0.535903 -0.351269 -0.386534 -0.225917 -0.198269 -0.257485 0.233444 0.217448 0.235743 0.221031 0.227898 0.232085 0.274943 0.228421 0.243518 0.243960 0.260826 0.226332 0.226665 0.232239 0.215840 0.240348 0.219554 0.219851 0.241741 0.258280 0.246661 0.223517 0.225435 0.226680
chargesum: 0.00000
title: Mulliken charges with hydrogens summed into heavy atoms:
elementType: O O O N N C C C C C C C C C C C C C C C C C C C C
charge: -0.299380 -0.281404 -0.277994 -0.184214 -0.138546 0.035646 0.073899 0.096042 0.090879 0.467979 0.243264 -0.027187 -0.247414 -0.174688 0.147368 0.350835 -0.000700 -0.159353 0.378625 0.145244 -0.092990 -0.139873 -0.002400 0.027167 -0.030805
polarizability: 3.77337181e+02 -8.86355899e+00 2.21265437e+02 -1.08200870e+01 -3.22859513e+00 1.46619267e+02
1716.lowfreq: -8.8793 -4.5108 0.0005 0.0009 0.0011 2.8245 7.9575 19.5483 26.0170
frequency: 7.0691 18.6528 25.6387 32.4626 50.1002 56.6608 78.6555 91.5893 100.2692 119.9069 132.8556 136.8593 164.9297 186.0269 202.6582 220.9245 233.6737 237.5038 256.1097 264.6082 271.5207 292.6358 324.8264 365.6811 408.3374 412.3396 448.5076 452.4497 479.7786 495.1331 503.5516 511.0777 553.7392 559.9966 578.6202 597.0289 609.7168 612.8786 628.7517 682.4415 689.9392 692.4363 743.2758 753.8697 758.2699 802.4528 814.8295 816.5858 825.8242 831.3695 841.4498 865.5942 890.6163 926.6406 948.0797 950.1633 961.3928 973.9995 977.0158 981.0431 982.1327 986.8548 1017.2508 1021.8402 1032.8142 1050.0004 1057.8689 1075.5929 1082.5494 1082.7443 1097.6651 1106.7240 1111.6766 1153.6755 1165.1271 1166.4759 1174.3188 1178.7786 1179.3016 1197.7415 1200.0333 1205.8333 1219.9551 1243.8603 1254.8350 1273.8592 1282.7223 1285.7208 1304.2361 1313.9930 1340.7500 1357.1112 1361.1461 1362.4306 1368.0861 1378.5864 1389.0698 1398.1371 1403.1407 1434.6795 1443.1298 1445.9204 1458.0497 1466.0370 1473.5193 1474.4089 1475.5528 1478.0997 1484.3520 1487.2967 1493.3804 1499.5372 1575.5386 1580.1432 1591.3980 1611.6470 1628.3821 2922.6578 2934.4871 2957.3985 2960.1755 2983.0225 2984.1504 2991.1492 3013.6639 3033.2132 3038.6137 3041.9563 3044.2701 3063.4601 3078.9407 3120.8224 3127.6036 3128.4704 3136.2470 3155.0425 3160.9734 3163.7023 3172.3704 3172.3969 3176.2283
redmass: 5.0507 4.1884 4.4667 5.2928 4.4704 5.0171 4.0205 3.5291 3.9913 5.4657 3.5773 1.9184 2.9296 4.7134 1.6662 3.5756 5.0185 4.3260 3.4814 2.4323 2.2004 3.4898 2.3225 4.4302 5.0101 2.9296 4.1743 3.2751 3.7331 3.8537 2.8693 4.9561 4.2599 3.0899 5.1024 3.8165 6.3003 4.5435 2.4820 1.9042 3.9511 2.0459 4.0711 1.6481 1.6495 5.2606 2.9496 1.5494 1.4998 1.2734 1.7175 1.5381 1.4565 3.2721 1.3551 3.1638 1.3612 5.8512 5.0092 1.2981 2.5444 5.7320 3.3332 2.0894 2.4968 1.7073 1.8266 2.0581 1.8891 1.6106 1.6848 2.8599 1.2592 1.3948 1.1519 1.0837 2.2914 1.1893 1.5585 1.4843 1.4535 1.5129 2.9731 1.6767 1.7961 1.2178 1.4692 1.3333 1.4624 1.3374 1.3002 1.4431 1.4815 1.7687 1.7116 1.8903 5.3210 4.5307 3.2219 1.2662 2.3515 1.1154 2.4988 1.0506 1.4323 1.1535 1.1510 1.1336 1.3823 1.2939 1.1128 1.9011 5.9239 7.9189 6.4087 6.2761 6.6023 1.0705 1.0678 1.0329 1.0642 1.0675 1.0607 1.0563 1.0947 1.1000 1.0980 1.0910 1.1039 1.1076 1.0954 1.0992 1.0847 1.0870 1.0891 1.0927 1.0920 1.0953 1.1002 1.0914 1.0952
irintensity: 0.0063 0.3216 0.1228 1.0033 7.3818 0.3795 1.5612 3.0763 2.2501 1.2304 6.0033 0.2702 7.8289 3.7083 0.2839 0.7045 1.0354 15.8368 2.0219 0.2589 3.4120 8.5036 3.1519 0.8177 8.5181 0.0228 0.8333 5.3076 0.1388 2.8006 12.2190 6.3003 11.1915 3.3713 5.2107 10.4331 2.0123 1.1831 4.9577 27.4521 7.3039 35.6643 6.3076 46.4938 92.3750 11.1654 15.9109 6.0644 4.1646 3.0952 38.6328 4.4293 7.8630 2.1767 0.5956 0.2553 0.0956 79.0323 22.5394 0.5751 25.8609 40.7060 143.4479 10.6305 7.5851 1.7089 1.7380 4.7648 5.7007 12.8030 9.7708 0.8631 0.2555 16.9744 1.8544 13.3805 124.8246 67.4202 88.5755 122.7398 46.3136 104.2359 206.3471 30.7841 14.3898 0.7011 83.6668 4.6306 0.7934 0.7019 1.3435 6.6423 15.8589 32.1210 6.0668 98.9069 5.4676 100.0492 221.5848 7.0474 2.8912 50.3894 13.4201 12.3180 197.1428 20.0032 7.6680 31.5114 23.9864 82.5776 15.0096 77.0401 92.4687 317.2980 38.5622 91.4032 387.0250 81.1372 37.3572 77.8780 39.1466 33.4088 8.3641 22.3082 42.4727 5.8523 32.1921 21.4293 51.7135 36.0352 7.3115 27.8548 2.8660 14.4525 13.0030 34.7988 23.1880 22.1698 8.7951 9.5620 3.5547
temp: 298.150 k
press: 1.00000 atm
elementType: 8 8 8 7 7 6 6 6 6 6 6 6 6 6 6 6 6 6 6 6 6 6 6 6 6 1 1 1 1 1 1 1 1 1 1 1 1 1 1 1 1 1 1 1 1 1 1 1 1
symmnumber: 1
zpe: 1058562.0 jmol-1
zpe.correction: 0.403185 hartree
zpe.thermalcorrener: 0.426921 hartree
zpe.thermalcorrenthalpy: 0.427865 hartree
zpe.thermalcorrgfe: 0.345765 hartree
zpe.sumelectzpe: -1109.828700 hartree
zpe.sumelectthermal: -1109.804964 hartree
zpe.sumelectthermalent: -1109.804020 hartree
zpe.sumelectthermalfe: -1109.886120 hartree
dipole: -2.9693 2.3172 0.0646
dipole: 3.7670
quadrupole: -133.2955 -146.1173 -151.7481
quadrupole: -1.1037 -1.2286 -3.9498
quadrupole: 10.4248 -2.3970 -8.0278 -1.1037 -1.2286 -3.9498
hfenergy: -1110.231885 hartree
pointgroup: C01 [X(C20H24N2O3)]
dipole: -1.2167175 -0.1799747 -0.8268551 debye
polarizability: 377.7920528|-10.730769|152.9253279|2.9274698|20.9578175|214.504504 unknown
InChI: InChI=1S/C20H24N2O3/c1-24-19-9-5-6-17(16-19)21-11-13-22(14-12-21)20(23)10-15-25-18-7-3-2-4-8-18/h2-9,16H,10-15H2,1H3
charge 0 multiplicity 1
49 atoms
O  1.770963 -0.705591 2.062205
O  4.577879 -0.102549 -1.022217
O  -6.955092 1.670695 1.170997
N  -2.839138 -0.574196 0.043194
N  0.015598 -0.82854 0.540614
C  -1.963487 -1.295733 -0.893619
C  -2.238413 -0.12843 1.317758
C  -0.521362 -0.752656 -0.838095
C  -0.975627 -0.945179 1.635524
C  -4.202004 -0.366028 -0.22492
C  1.360786 -0.687528 0.855433
C  2.327436 -0.50782 -0.319664
C  -4.961034 0.539076 0.569157
C  -4.867245 -1.053014 -1.292135
C  3.750291 -0.266014 0.186491
C  -6.333629 0.748072 0.308606
C  -6.232127 -0.819523 -1.536355
C  -6.993272 0.076503 -0.750133
C  5.951017 0.137435 -0.839249
C  -8.372627 1.955071 0.944856
C  6.584237 0.223852 0.426127
C  6.70456 0.295486 -2.029483
C  7.976349 0.469097 0.485575
C  8.089863 0.539306 -1.951993
C  8.736169 0.627894 -0.693845
H  -2.331807 -1.146966 -1.924316
H  -1.956243 -2.391705 -0.700605
H  -2.965855 -0.28123 2.138547
H  -1.98826 0.954832 1.296181
H  0.105262 -1.349416 -1.525982
H  -0.516514 0.296452 -1.200652
H  -0.493358 -0.58125 2.558031
H  -1.244231 -2.008118 1.79684
H  2.321988 -1.406026 -0.968126
H  2.01643 0.340437 -0.959291
H  -4.508893 1.120449 1.376503
H  -4.337072 -1.789937 -1.90192
H  3.797767 0.64409 0.814376
H  4.106495 -1.12289 0.788515
H  -6.724203 -1.36138 -2.35254
H  -8.05432 0.230651 -0.961603
H  -8.992163 1.045113 1.067334
H  -8.543414 2.385012 -0.061551
H  -8.644128 2.693423 1.713971
H  6.016998 0.104305 1.353692
H  6.188271 0.224052 -2.991968
H  8.464191 0.535497 1.464768
H  8.667162 0.660746 -2.875513
H  9.813107 0.81767 -0.63702
