program: Gaussian 09
title: 000278263
version: EM64L-G09RevD.01
frameworkgroup: C1[X(C9H6BrNO6)]
method: RPBEPBE
basis: SDD
operation: Freq
keyword: #p
keyword: freq=noraman
keyword: PBEPBE/SDD
title: #p freq=noraman PBEPBE/SDD
converged: YES YES NO NO
title: Mulliken charges:
elementType: Br O O O O O O N C C C C C C C C C H H H H H H
charge: 0.069622 -0.208981 -0.247015 -0.247731 -0.187282 -0.182427 -0.170291 0.020919 0.064468 0.221462 0.211145 0.436238 -0.342468 -0.393395 -0.203010 0.116164 -0.497496 0.287778 0.254523 0.258079 0.247698 0.256564 0.235437
chargesum: 0.00000
title: Mulliken charges with hydrogens summed into heavy atoms:
elementType: Br O O O O O O N C C C C C C C C C
charge: 0.069622 -0.208981 -0.247015 -0.247731 -0.187282 -0.182427 -0.170291 0.020919 0.064468 0.221462 0.211145 0.436238 -0.054690 -0.393395 0.309592 0.116164 0.242203
polarizability: 2.08403424e+02 3.65920901e+00 1.63853113e+02 8.26014451e+00 1.16893726e+00 7.48644068e+01
1716.lowfreq: -1.8972 0.0005 0.0006 0.0008 5.1362 7.8572 23.0973 41.1081 53.2950
frequency: 22.9468 41.0943 53.2774 78.0401 100.5109 109.6046 118.3295 138.4949 139.8060 189.1463 208.4806 227.4107 251.1889 272.2583 295.7340 304.3967 369.3236 385.8009 412.7957 489.1380 520.3301 625.7078 662.3571 668.6212 674.1889 683.7034 718.9783 737.7757 750.1553 781.4344 825.7162 871.0189 875.5306 926.0146 961.6932 984.9474 1061.4935 1090.0673 1114.4408 1119.1431 1129.7134 1152.0822 1200.4229 1210.9591 1252.9484 1349.2302 1363.4967 1370.3779 1400.0426 1422.5480 1454.1271 1457.4576 1462.1179 1482.3667 1595.2933 1605.4565 1641.2453 3008.6731 3033.7844 3114.6877 3122.3881 3156.1428 3198.2422
redmass: 7.5933 4.5489 3.1851 4.5656 2.1867 5.6627 1.8616 9.0012 15.3087 9.6282 7.0955 8.1445 12.6310 5.9155 5.5378 12.0834 10.1962 10.3996 10.4307 5.3177 7.7457 9.8181 10.9584 10.8437 8.0746 10.9381 8.2342 9.7477 8.3053 10.5516 8.8746 1.6068 5.2203 8.5878 7.7251 8.1796 1.4518 4.7670 1.3030 1.0404 3.3421 1.4450 2.5506 12.2242 8.5093 2.9691 4.0446 2.1960 5.3675 1.2833 1.0705 3.6910 1.0544 1.2373 11.0040 9.3456 10.8826 1.0290 1.0543 1.1052 1.1188 1.1052 1.0941
irintensity: 1.3365 8.2659 7.5868 1.6355 0.6528 1.1013 0.4163 0.7010 2.7103 2.9095 3.0521 0.4784 0.2301 6.3822 9.3736 7.5675 1.6086 1.4277 3.7452 9.8937 8.1406 19.1723 45.5167 5.2958 3.0180 0.6298 8.6879 9.5554 7.3399 7.5448 31.8817 30.4079 10.2207 4.7019 20.7145 211.0419 4.1051 124.4785 1.2228 0.2598 42.9387 23.6943 83.5090 294.1113 334.3497 54.6716 9.9650 68.3711 94.5734 24.4360 11.3417 202.1965 9.3045 21.4580 0.1364 16.6702 180.9439 29.4766 82.4782 15.6223 16.7855 12.8160 1.9308
temp: 298.150 k
press: 1.00000 atm
elementType: 35 8 8 8 8 8 8 7 6 6 6 6 6 6 6 6 6 1 1 1 1 1 1
symmnumber: 1
zpe: 377092.2 jmol-1
zpe.correction: 0.143627 hartree
zpe.thermalcorrener: 0.159724 hartree
zpe.thermalcorrenthalpy: 0.160669 hartree
zpe.thermalcorrgfe: 0.097331 hartree
zpe.sumelectzpe: -864.742992 hartree
zpe.sumelectthermal: -864.726894 hartree
zpe.sumelectthermalent: -864.725950 hartree
zpe.sumelectthermalfe: -864.789288 hartree
dipole: -2.3163 -3.3680 -1.9228
dipole: 4.5173
quadrupole: -87.5062 -110.0339 -108.4962
quadrupole: 14.5483 -7.3582 -4.3541
quadrupole: 14.5059 -8.0218 -6.4841 14.5483 -7.3582 -4.3541
hfenergy: -864.8866187 hartree
pointgroup: C01 [X(C9H6Br1N1O6)]
dipole: 1.4033175 0.8466092 -0.6874245 debye
dipolederiv: -0.1590637 0.3036985 0.0128238 0.2489017 -0.4383956 -0.0374539 -0.0069732 -0.0219256 0.0213271 -1.328498 0.2623405 0.0739389 0.5532738 -0.4357821 -0.0301753 0.0851057 -0.0186814 -0.2106128 -1.4337215 0.232401 0.0620506 0.1412398 -0.4613517 -0.0012384 0.0868042 -0.024459 -0.2472466 -1.046552 -0.2315226 -0.314143 -0.2265497 -0.381943 -0.2193236 -0.6041876 -0.2291095 -0.89309 -0.7431306 0.0048167 0.2711294 -0.0136699 -0.3464114 -0.1206026 -0.082525 -0.1515482 -0.7866302 -0.7846391 -0.1084294 0.2087805 -0.1008633 -0.5472207 0.0324973 0.2141952 -0.0163111 -0.3012116 -0.3917131 0.0906379 0.1332461 0.0867469 -0.756418 -0.1398028 0.1700414 -0.1156145 -0.2905427 1.0559805 0.2575661 -0.4164092 0.3691623 1.4953719 0.1379739 -0.3905281 0.1385305 0.4058577 0.6248861 -0.1135073 -0.0424203 -1.0309685 0.3411596 0.0658838 -0.1476378 -0.058928 0.0878948 1.2634299 -0.1213211 -0.067327 0.447231 -0.0661254 -0.0291967 -0.0481253 0.0109389 0.0680781 0.0341112 -0.2606998 0.0591152 -0.4327884 -0.4906875 -0.0244361 -0.0638721 -0.0024614 0.0282497 -0.444393 -0.0726293 0.0015046 0.2889554 -0.1787031 -0.0572743 0.0953417 0.0519603 -0.0280374 -0.134767 0.1707987 -0.0009447 0.2276432 -0.1478532 -0.0133716 -0.0045297 0.0037309 -0.080321 0.2267716 -0.6029416 -0.0353997 -0.6141473 0.8199659 0.0768912 0.0101135 0.0557395 -0.1372092 1.179578 -0.1897659 -0.024497 -0.2026003 0.6033171 -0.0050799 -0.005228 0.0129547 0.5402083 1.4403174 0.2295731 0.0045737 0.1319615 0.5368871 0.3614617 0.5709958 0.3308249 1.4210435 0.6416637 0.1226042 0.1687659 0.0804868 0.258769 0.0244772 0.1232751 0.0318532 0.2585332 0.0944358 -0.0262952 0.0037064 -0.0372131 0.0505842 -0.0042764 0.0052742 -0.006782 0.1760716 -0.0691668 0.0441379 -0.0424101 0.0482956 0.0490463 0.021554 -0.140171 0.050828 -0.0400633 -0.055314 0.0319204 0.0485539 0.0328141 0.0561228 -0.0137032 0.1221676 -0.0384318 -0.0389299 -0.041035 0.0182779 -0.0275801 0.0938734 -0.0368828 -0.0391215 0.0576253 -0.0499223 0.0943933 0.0182912 -0.0200161 -0.0540192 -0.0533641 -0.0213934 0.0636047 0.0358589 0.1034177 0.0329915 0.0525282 -0.0216448 -0.0230386 -0.0384209 0.0979439 -0.0492875 -0.083021 -0.0566041 -0.0807539 unknown
polarizability: 202.4107923|-14.7202362|168.4940294|-9.8101633|11.2997403|76.2161222 unknown
InChI: InChI=1S/C9H6BrNO6/c1-15-9(12)6-4(10)2-5-8(17-3-16-5)7(6)11(13)14/h2H,3H2,1H3
charge 0 multiplicity 1
23 atoms
Br -1.358882 3.404318 0.284684
O  2.649457 -1.20263 -0.211258
O  3.468602 1.054074 -0.129055
O  -2.681733 -0.13045 -0.966376
O  -2.885369 0.535369 1.264684
O  -1.429617 -2.169586 0.577226
O  0.463422 -2.84685 -0.504877
N  -0.283864 -1.940585 0.024428
C  1.586808 -0.30087 -0.090301
C  2.06441 1.030926 -0.039905
C  0.209777 -0.551784 0.013644
C  -0.698952 0.548387 0.150009
C  1.2196 2.128958 0.085693
C  -0.173767 1.857414 0.17531
C  3.892922 -0.369845 -0.192514
C  -2.18957 0.30816 0.255848
C  -4.120294 -0.500918 -0.975358
H  1.607389 3.148604 0.11139
H  4.472273 -0.618425 0.71218
H  4.443299 -0.54472 -1.13022
H  -4.735576 0.353036 -0.647296
H  -4.278969 -1.357219 -0.299052
H  -4.332069 -0.771365 -2.018586
