program: Gaussian 09
title: 000278283
version: EM64L-G09RevD.01
frameworkgroup: C1[X(C17H15NO4)]
method: RPBEPBE
basis: SDD
operation: Freq
keyword: #p
keyword: freq=noraman
keyword: PBEPBE/SDD
title: #p freq=noraman PBEPBE/SDD
converged: YES YES NO NO
title: Mulliken charges:
elementType: O O O O N C C C C C C C C C C C C C C C C C H H H H H H H H H H H H H H H
charge: -0.251936 -0.254951 -0.268859 -0.211361 -0.363945 0.385485 -0.684477 0.193396 0.241835 -0.517629 0.192366 -0.482415 0.228789 -0.534600 -0.202428 0.484480 -0.242065 -0.438982 -0.366054 -0.217366 -0.225628 -0.239932 0.260500 0.260237 0.268217 0.301327 0.231200 0.268133 0.332132 0.247200 0.246632 0.196368 0.233697 0.244670 0.228202 0.227310 0.230453
chargesum: 0.00000
title: Mulliken charges with hydrogens summed into heavy atoms:
elementType: O O O O N C C C C C C C C C C C C C C C C C
charge: -0.251936 -0.254951 -0.268859 -0.211361 -0.031814 0.385485 -0.163740 0.193396 0.241835 -0.249411 0.192366 -0.181088 0.228789 -0.035267 0.291403 0.484480 -0.045697 -0.205285 -0.121384 0.010837 0.001681 -0.009478
polarizability: 1.85430092e+02 8.55998978e+00 2.35790207e+02 7.01681832e+00 -1.21250763e+01 1.89659827e+02
1716.lowfreq: -11.3200 -8.3105 -2.4204 0.0008 0.0008 0.0008 6.9749 12.6294 23.1249
frequency: -3.2063 11.0401 22.9903 25.3824 34.8567 49.9702 64.1107 96.3090 152.9029 180.7711 185.5172 192.8690 220.4211 252.3029 281.6913 298.1113 305.0865 357.4989 367.2119 390.4265 403.4836 441.6496 479.6758 489.2914 536.4519 581.0427 585.1883 599.8970 604.9520 617.7301 638.1226 674.3714 684.4687 705.4562 722.7410 752.4647 759.3393 768.6638 804.9729 833.8027 844.4574 854.7195 871.4497 877.8178 911.5555 917.6564 932.5141 974.4327 976.2356 977.7517 990.2844 996.1277 1006.2401 1019.0356 1026.1827 1062.4526 1063.0051 1089.0014 1119.8337 1139.6719 1159.5302 1172.8413 1185.3216 1187.3096 1214.1580 1216.0362 1235.5095 1239.2826 1268.3824 1292.3736 1320.8636 1353.6579 1360.7224 1377.5364 1386.3910 1417.9602 1428.4663 1441.7502 1460.9435 1469.6470 1471.1219 1484.9703 1485.9292 1491.7010 1578.5753 1595.4653 1608.4743 1611.9277 1615.0899 1621.2350 2929.6663 2991.8538 3016.0342 3024.6095 3050.9238 3066.2821 3106.9588 3116.8962 3123.6122 3135.8661 3147.1127 3164.2293 3169.1754 3174.6194 3532.2476
redmass: 3.7284 4.3126 3.9618 4.3757 6.8573 5.5690 5.7109 8.6646 5.9544 3.7205 5.4196 4.1493 6.4596 5.6157 4.0061 2.6986 3.9136 6.8715 6.1321 3.3508 2.7956 3.1285 3.7243 3.9925 3.2686 5.5471 4.7468 5.1130 5.0394 6.1672 1.2591 7.0523 8.3790 1.7714 4.5261 3.1546 2.7382 5.7637 3.9466 9.5916 3.3201 1.2590 2.8381 1.5054 1.3532 1.4183 2.1207 2.2318 3.4303 1.3978 6.0432 1.3559 2.4663 4.3335 2.2187 4.2842 1.5520 1.5997 1.0377 2.7671 1.7105 1.0544 1.4714 1.1153 2.3938 2.0325 1.2821 1.3698 3.5128 1.7616 1.3152 1.4062 1.3415 1.5725 5.7707 5.3249 2.8578 2.1397 1.1436 2.2445 1.1958 1.9582 1.4072 1.7905 7.6771 6.0610 8.2079 7.9247 6.1093 7.8764 1.0852 1.0606 1.0610 1.0536 1.1012 1.0995 1.1192 1.0874 1.0863 1.0913 1.0962 1.1015 1.0931 1.0931 1.0775
irintensity: 2.7789 4.4465 4.5865 0.9669 5.6696 1.6423 3.5575 4.4540 2.9612 0.5085 4.2455 5.8527 3.5409 0.9718 2.7382 2.3610 7.9777 3.0402 0.0468 6.3049 0.5120 13.9134 23.7421 29.6311 17.8788 17.3082 9.2751 7.1459 3.0338 0.5644 61.7957 2.0413 1.6544 53.7661 0.8934 9.5005 40.8072 9.0176 8.9638 27.6078 11.3845 0.0655 2.9605 12.9256 18.2837 4.7891 3.0069 48.5903 111.4409 0.1545 0.1486 1.2235 8.4075 25.2290 8.0173 4.3368 2.6401 12.5983 0.0186 6.9500 19.3334 0.0466 5.9944 2.5152 4.6196 47.8827 76.0480 63.5237 274.2055 72.5981 12.6043 8.4728 1.7471 12.4818 3.3239 29.8486 2.6961 21.8221 67.9156 198.6666 46.2202 6.5979 61.6512 149.9651 234.8977 0.5080 78.1584 246.2173 10.8478 19.9772 80.8289 34.1469 11.1137 104.8075 10.4542 2.6781 23.8435 7.4144 1.3819 12.0093 37.3175 20.7895 0.8612 7.6784 26.0505
temp: 298.150 k
press: 1.00000 atm
elementType: 8 8 8 8 7 6 6 6 6 6 6 6 6 6 6 6 6 6 6 6 6 6 1 1 1 1 1 1 1 1 1 1 1 1 1 1 1
symmnumber: 1
zpe: 743640.1 jmol-1
zpe.correction: 0.283238 hartree
zpe.thermalcorrener: 0.301882 hartree
zpe.thermalcorrenthalpy: 0.302826 hartree
zpe.thermalcorrgfe: 0.232189 hartree
zpe.sumelectzpe: -1010.873541 hartree
zpe.sumelectthermal: -1010.854897 hartree
zpe.sumelectthermalent: -1010.853953 hartree
zpe.sumelectthermalfe: -1010.924590 hartree
dipole: 0.9010 5.7794 -0.9810
dipole: 5.9309
quadrupole: -124.8103 -131.5277 -132.3083
quadrupole: 2.9256 -14.8484 1.0171
quadrupole: 4.7385 -1.9790 -2.7595 2.9256 -14.8484 1.0171
hfenergy: -1011.156779 hartree
pointgroup: C01 [X(C17H15N1O4)]
dipole: 0.3396184 -1.6395187 1.6252465 debye
polarizability: 184.9594715|-10.8451096|209.3895378|-0.944596|-25.6370582|216.5311175 unknown
InChI: InChI=1S/C17H15NO4/c19-10-14-7-16-15(21-11-22-16)6-13(14)8-17(20)18-9-12-4-2-1-3-5-12/h1-7,10,18H,8-9,11H2
charge 0 multiplicity 1
37 atoms
O  2.893569 -1.495046 2.382115
O  3.789336 -2.37442 0.333275
O  -1.567739 3.353134 -0.335673
O  2.218497 0.856181 -3.518977
N  -1.280574 1.069888 -0.699131
C  1.48409 1.154208 0.110872
C  0.638813 2.418786 0.155289
C  2.519072 -0.684622 1.296823
C  2.019587 0.628454 -1.112364
C  1.743146 0.475731 1.33699
C  3.045369 -1.19598 0.085672
C  2.81353 -0.56489 -1.127022
C  -0.833601 2.319142 -0.320015
C  -2.660409 0.831468 -1.165226
C  3.733242 -2.587888 1.801727
C  -3.394242 -0.209222 -0.326388
C  1.778526 1.294014 -2.41795
C  -3.968241 -1.351917 -0.934987
C  -3.529378 -0.036488 1.07567
C  -4.667548 -2.306754 -0.160274
C  -4.224822 -0.988507 1.851478
C  -4.796887 -2.127806 1.235409
H  0.586782 2.798396 1.191562
H  1.086414 3.238184 -0.435036
H  1.34954 0.854405 2.284123
H  3.205392 -0.930517 -2.080162
H  -2.645003 0.518147 -2.226701
H  -3.163579 1.81494 -1.112203
H  -0.642713 0.272959 -0.63749
H  3.247899 -3.555371 2.011152
H  4.75066 -2.511355 2.220799
H  1.172124 2.228471 -2.395534
H  -3.869776 -1.495635 -2.018478
H  -3.093779 0.849745 1.552624
H  -5.107523 -3.185983 -0.644116
H  -4.327361 -0.842268 2.932728
H  -5.338212 -2.866079 1.837518
