program: Gaussian 09
title: 000278285
version: EM64L-G09RevD.01
frameworkgroup: C1[X(C17H11NO6)]
method: RPBEPBE
basis: SDD
operation: Freq
keyword: #p
keyword: freq=noraman
keyword: PBEPBE/SDD
title: #p freq=noraman PBEPBE/SDD
converged: YES YES NO NO
title: Mulliken charges:
elementType: O O O O O O N C C C C C C C C C C C C C C C C C H H H H H H H H H H H
charge: -0.214403 -0.257541 -0.258196 -0.206488 -0.202892 -0.207130 0.022713 0.304278 0.283566 0.081162 -0.482545 -0.494446 0.187279 0.183344 -0.537095 0.137026 -0.306431 -0.203779 0.330223 0.171425 -0.324180 -0.373816 -0.231404 -0.210406 0.251324 0.232568 0.291621 0.264101 0.257947 0.242127 0.245149 0.254184 0.286512 0.240674 0.243527
chargesum: 0.00000
title: Mulliken charges with hydrogens summed into heavy atoms:
elementType: O O O O O O N C C C C C C C C C C C C C C C C C
charge: -0.214403 -0.257541 -0.258196 -0.206488 -0.202892 -0.207130 0.022713 0.304278 0.283566 0.081162 0.001347 -0.202825 0.187279 0.183344 -0.272994 0.137026 -0.048484 0.283498 0.330223 0.171425 -0.069996 -0.087304 0.009270 0.033121
polarizability: 3.98604161e+02 2.61750348e+00 2.31767179e+02 2.91685239e+00 -1.47083346e+01 1.07179106e+02
1716.lowfreq: -6.3600 -2.8953 -0.0008 -0.0007 -0.0006 5.9415 18.2339 31.6298 37.6773
frequency: 18.1268 31.6181 37.6745 51.2753 59.3029 78.7233 92.0300 125.8713 140.0503 158.3989 175.8839 208.7798 239.2914 263.9368 279.3237 291.6002 360.6081 368.4803 374.4550 389.0370 420.2093 427.9261 442.9394 476.5096 495.3284 531.4646 536.8272 567.9217 607.5303 643.1807 651.3200 666.5988 672.0247 682.2625 697.2395 717.5956 729.7231 748.7825 767.5450 773.8427 780.6894 791.3416 829.8011 841.5928 862.1494 864.0398 884.8149 889.9189 927.8460 951.4474 975.6129 977.0963 989.2284 1000.3668 1031.6383 1039.2600 1060.6976 1066.7379 1079.2990 1122.5487 1137.5111 1168.8772 1173.1939 1185.4538 1199.9222 1202.3828 1224.1431 1242.7059 1282.0127 1297.2598 1328.2554 1341.4985 1358.4314 1363.8836 1383.8046 1416.0243 1432.9655 1442.4126 1464.7411 1467.2923 1475.2206 1487.2873 1568.8595 1602.7986 1608.8047 1614.0121 1620.1356 1643.5918 2978.0518 3015.3678 3095.8608 3107.6727 3132.7543 3144.8097 3160.1165 3168.9034 3173.3251 3174.9114 3188.4900
redmass: 8.0563 6.9622 5.8930 3.1574 5.7803 8.1269 6.7986 9.1323 6.0197 5.8744 4.4731 6.2984 5.5620 6.3700 8.4869 4.9973 7.5626 5.7484 7.5032 7.0226 3.9057 3.7426 4.5927 5.3895 5.2948 4.6427 6.6310 7.5226 6.0289 7.3269 5.9396 6.6982 5.3303 9.6898 6.4977 5.4437 4.1072 6.9012 6.0354 6.7554 1.4901 5.6260 4.7320 8.2514 1.4483 1.4011 1.4271 1.5640 4.0290 8.6951 4.2238 1.4581 1.8814 1.3423 6.0785 2.9893 3.2663 1.4690 3.5541 1.0459 2.0407 2.0579 1.2982 1.6093 1.5300 4.4386 2.6126 1.2848 1.8087 4.0157 2.0208 1.5142 3.2209 1.4764 4.7627 5.8492 2.5995 4.9779 1.2373 2.2318 1.9521 1.4886 6.4581 7.3888 7.3338 9.7751 8.4741 11.2561 1.0680 1.0568 1.0962 1.1154 1.0877 1.0866 1.0913 1.0933 1.0969 1.0937 1.0973
irintensity: 0.9246 1.8192 3.0830 9.7997 1.3062 10.2634 3.5174 0.2818 0.7349 4.0245 6.8911 1.1929 0.5622 1.5606 12.8964 3.2998 3.3536 0.7388 4.8250 0.1645 6.3559 1.3207 2.7196 4.5985 8.8503 4.7176 2.3700 8.4146 3.1181 5.8960 2.5048 9.4208 29.3888 0.5476 5.1114 1.4560 6.7281 4.1902 11.8216 9.1899 42.6786 14.7051 8.7583 26.9433 59.9582 11.8543 16.7394 3.6239 39.4068 58.2376 138.5761 12.4982 21.4559 0.3606 30.8601 3.8254 14.9790 6.1680 209.0055 1.2477 17.7508 12.2763 47.5869 14.6115 157.8936 112.6462 31.0080 0.9557 4.1598 243.4145 274.4908 26.9582 76.3357 12.0478 19.3615 7.1932 1.7798 8.8740 39.7795 17.9471 172.8482 73.7698 25.0113 14.3150 34.6099 29.7918 12.7073 150.3842 43.3128 135.3683 14.7287 27.1982 2.5341 1.6040 14.3141 3.7317 9.3147 2.2763 8.7221
temp: 298.150 k
press: 1.00000 atm
elementType: 8 8 8 8 8 8 7 6 6 6 6 6 6 6 6 6 6 6 6 6 6 6 6 6 1 1 1 1 1 1 1 1 1 1 1
symmnumber: 1
zpe: 646229.4 jmol-1
zpe.correction: 0.246136 hartree
zpe.thermalcorrener: 0.265604 hartree
zpe.thermalcorrenthalpy: 0.266549 hartree
zpe.thermalcorrgfe: 0.195673 hartree
zpe.sumelectzpe: -1158.709248 hartree
zpe.sumelectthermal: -1158.689779 hartree
zpe.sumelectthermalent: -1158.688835 hartree
zpe.sumelectthermalfe: -1158.759711 hartree
dipole: 2.4689 1.8654 -4.7629
dipole: 5.6798
quadrupole: -103.7958 -144.3917 -141.9590
quadrupole: -10.8205 10.7229 -6.6348
quadrupole: 26.2530 -14.3429 -11.9102 -10.8205 10.7229 -6.6348
hfenergy: -1158.9553835 hartree
pointgroup: C01[X(C17H11N1O6)]
dipole: 0.9686599 0.7837898 -1.8549598 debye
polarizability: 397.864973|10.0882456|232.4380282|8.3231217|-13.8558667|107.2474453 unknown
InChI: InChI=1S/C17H11NO6/c19-17-13(5-10-3-1-2-4-14(10)18(20)21)12-7-16-15(23-9-24-16)6-11(12)8-22-17/h1-7H,8-9H2
charge 0 multiplicity 1
35 atoms
O  0.44581 2.968785 0.85373
O  4.110786 -2.19687 -0.213575
O  5.554729 -0.278043 -0.226227
O  -1.524894 1.994568 1.465157
O  -3.627136 -3.34548 0.6911
O  -1.501751 -2.554169 0.539098
N  -2.782014 -2.421843 0.376494
C  1.42468 0.433904 -0.058118
C  2.288743 1.56395 -0.054861
C  -0.036958 0.685208 0.019659
C  1.63627 2.925225 -0.043364
C  1.963198 -0.890124 -0.094153
C  3.348887 -1.005711 -0.158174
C  4.201974 0.122425 -0.16448
C  3.700371 1.423623 -0.10353
C  -0.46528 1.892184 0.813865
C  -0.947075 -0.205863 -0.499598
C  5.531553 -1.766271 -0.135301
C  -2.421377 -0.087114 -0.536117
C  -3.302996 -1.155692 -0.191098
C  -3.030896 1.099245 -1.031506
C  -4.707985 -1.054416 -0.32435
C  -4.42634 1.214998 -1.168507
C  -5.272168 0.134065 -0.817264
H  2.303175 3.707755 0.349685
H  1.296781 3.222002 -1.0564
H  1.322428 -1.772842 -0.027036
H  4.36611 2.290761 -0.093025
H  -0.537962 -1.089995 -1.000875
H  5.949075 -2.070601 0.841203
H  6.082451 -2.1849 -0.992161
H  -2.387215 1.934226 -1.322777
H  -5.324573 -1.906461 -0.027722
H  -4.856017 2.146761 -1.550564
H  -6.357886 0.221708 -0.922409
