program: Gaussian 09
title: 000278226
version: EM64L-G09RevD.01
frameworkgroup: C1[X(C12H14O3)]
method: RPBEPBE
basis: SDD
operation: Freq
keyword: #pfreq=noraman
keyword: PBEPBE/SDD
title: #p freq=noraman PBEPBE/SDD
converged: NO YES NO NO
title: Mulliken charges:
elementType: O O O C C C C C C C C C C C C H H H H H H H H H H H H H H
charge: -0.277133 -0.207380 -0.245556 0.026411 -0.456001 0.552492 -0.408007 -0.628518 -0.392088 -0.192136 0.210436 -0.619010 -0.362890 0.182044 -0.504079 0.229070 0.240367 0.217427 0.207151 0.227938 0.261324 0.210447 0.217907 0.260761 0.264424 0.256025 0.243328 0.236356 0.248893
chargesum: 0.00000
title: Mulliken charges with hydrogens summed into heavy atoms:
elementType: O O O C C C C C C C C C C C C
charge: -0.277133 -0.207380 -0.245556 0.026411 0.013436 0.552492 0.016571 -0.139256 0.036266 0.068624 0.210436 -0.354586 -0.106865 0.182044 0.224497
polarizability: 1.74917619e+02 -1.28487056e+01 1.27736562e+02 -8.57759373e+00 -8.67818628e+00 1.04052097e+02
1716.lowfreq: -15.6344 -0.0004 0.0004 0.0006 6.6994 11.8510 44.5263 50.2793 91.5810
frequency: 44.4947 50.2248 91.5124 114.3641 136.2989 152.6972 191.4238 203.4079 223.3432 267.4223 305.8061 315.1653 359.9000 395.6953 407.5688 433.3896 466.5892 491.5838 540.6253 559.8092 646.6930 663.9765 685.2838 708.5833 742.8656 803.7973 821.5845 845.2143 876.3436 883.7363 894.6990 921.2316 931.1320 956.2406 981.9038 1000.5363 1029.6715 1074.8185 1090.2494 1104.6907 1108.5517 1114.4371 1138.5660 1148.8358 1161.6528 1166.6751 1221.2535 1243.2358 1268.9409 1289.0785 1312.4953 1314.4611 1337.7720 1348.2311 1365.2053 1371.1891 1422.0564 1452.8513 1459.6949 1461.1246 1463.8268 1471.3343 1474.5074 1557.7571 1609.7339 1636.5052 1663.5911 2975.5838 2982.8346 2990.9132 2998.9264 3008.0688 3037.8236 3047.3209 3060.2262 3072.6519 3112.0254 3126.3925 3134.8254 3153.5782 3157.0901
redmass: 5.9914 6.8800 2.9131 1.1622 3.1497 3.0677 5.0872 3.9297 4.1079 3.0729 3.1229 3.1794 3.4252 4.0294 3.1931 4.3985 2.9410 3.4066 3.8721 3.8245 3.2447 3.0207 4.5887 5.6739 5.0474 1.8249 1.5550 2.3812 3.1645 2.5952 1.8361 2.1632 2.1259 2.3963 2.8186 1.3085 3.4008 2.4014 2.0928 2.4574 1.8180 1.2707 2.0834 1.4194 1.3459 1.8478 1.4242 1.3412 1.4644 1.8114 1.4189 1.3651 1.3934 1.5630 2.1540 2.1028 1.1699 1.0497 1.0855 1.0879 1.0531 1.0872 1.0971 8.8488 8.5205 9.9779 7.4633 1.0629 1.0622 1.0615 1.0624 1.0293 1.0966 1.1005 1.1022 1.1026 1.1048 1.0856 1.0921 1.1052 1.0993
irintensity: 0.3595 1.4788 1.0296 0.1453 1.2156 3.1785 3.9127 2.5449 2.2359 8.5180 10.1801 4.8538 3.0775 4.7794 2.1503 1.8461 1.7617 3.5232 2.0975 10.6426 0.3280 17.4649 2.1257 0.7402 10.1711 5.2193 15.7031 12.9868 6.0044 7.5904 20.9049 7.2654 1.9013 13.2862 30.0030 2.5037 22.7302 76.0246 6.7421 111.7653 127.3223 0.8765 5.6023 14.7565 24.1362 53.5992 4.2122 0.9631 27.6797 5.1242 5.4480 9.2164 1.4661 1.0112 7.6605 24.8055 15.4015 13.6993 6.7516 8.8595 14.7516 23.4448 11.2528 169.0873 13.9994 151.2337 139.0441 30.2002 35.4147 10.9660 14.4885 33.2245 48.1074 48.5346 21.8892 24.4139 20.8745 1.8754 8.7715 13.1318 11.2565
temp: 298.150 k
press: 1.00000 atm
elementType: 8 8 8 6 6 6 6 6 6 6 6 6 6 6 6 1 1 1 1 1 1 1 1 1 1 1 1 1 1
symmnumber: 1
zpe: 615217.9 jmol-1
zpe.correction: 0.234324 hartree
zpe.thermalcorrener: 0.248235 hartree
zpe.thermalcorrenthalpy: 0.249179 hartree
zpe.thermalcorrgfe: 0.193531 hartree
zpe.sumelectzpe: -690.210862 hartree
zpe.sumelectthermal: -690.196951 hartree
zpe.sumelectthermalent: -690.196007 hartree
zpe.sumelectthermalfe: -690.251655 hartree
dipole: -6.0719 1.2826 2.2400
dipole: 6.5978
quadrupole: -100.7708 -79.4118 -90.8426
quadrupole: 10.2354 0.7924 -2.5912
quadrupole: -10.4290 10.9299 -0.5009 10.2354 0.7924 -2.5912
hfenergy: -690.4451859 hartree
pointgroup: C01 [X(C12H14O3)]
dipole: -2.4622824 -0.2129274 -0.7936093 debye
polarizability: 177.8056923|6.2799541|124.9190689|4.7714232|-10.2808002|103.9815168 unknown
InChI: InChI=1S/C12H14O3/c1-15-11(14)12-6-3-2-4-9(12)8-10(13)5-7-12/h5,7-8H,2-4,6H2,1H3
charge 0 multiplicity 1
29 atoms
O  -2.094267 1.598941 -0.278618
O  -1.376748 0.727645 1.750338
O  3.996078 0.532328 0.111501
C  -0.20392 0.085401 -0.378821
C  -0.954396 -0.75631 -1.488669
C  0.634136 -0.873669 0.465704
C  -1.76172 -1.924007 -0.87891
C  -0.104792 -2.049557 1.06889
C  -0.862998 -2.851108 -0.029594
C  0.605884 1.182836 -1.051699
C  -1.261506 0.802096 0.509425
C  1.987143 -0.714436 0.588892
C  1.952078 1.318153 -0.897395
C  2.737833 0.390329 -0.044814
C  -3.114523 2.386048 0.459152
H  -0.182319 -1.152181 -2.176333
H  -1.607903 -0.078273 -2.064693
H  -2.237809 -2.498683 -1.696202
H  -2.583956 -1.524908 -0.25055
H  0.603397 -2.707532 1.603338
H  -0.836872 -1.677155 1.811781
H  -0.127312 -3.353105 -0.689053
H  -1.469878 -3.643618 0.447045
H  0.03183 1.872808 -1.682209
H  2.583876 -1.425773 1.172847
H  2.513138 2.114222 -1.400348
H  -3.794771 1.710947 1.004428
H  -3.649604 2.948353 -0.318343
H  -2.6229 3.063506 1.176812
