program: Gaussian 09
title: 000278257
version: EM64L-G09RevD.01
frameworkgroup: C1[X(C11H11NO4S)]
method: RPBEPBE
basis: SDD
operation: Freq
keyword: #p
keyword: freq=noraman
keyword: PBEPBE/SDD
title: #p freq=noraman PBEPBE/SDD
converged: YES YES NO NO
title: Mulliken charges:
elementType: S O O O O N C C C C C C C C C C C H H H H H H H H H H H
charge: 0.974714 -0.253547 -0.544224 -0.517909 -0.247975 -0.551246 0.213458 0.352980 0.176422 -0.456774 -0.333226 -0.334469 0.158998 0.361441 -0.445313 -0.727344 -0.772103 0.280433 0.241792 0.298653 0.264874 0.261644 0.281241 0.282901 0.287190 0.243337 0.251009 0.253043
chargesum: 0.00000
title: Mulliken charges with hydrogens summed into heavy atoms:
elementType: S O O O O N C C C C C C C C C C C
charge: 0.974714 -0.253547 -0.544224 -0.517909 -0.247975 -0.252593 0.213458 0.352980 0.176422 -0.176341 -0.091434 -0.069595 0.158998 0.361441 -0.183670 0.123988 -0.024715
polarizability: 2.96027543e+02 -5.31089627e+00 1.74172612e+02 7.21390778e+00 -1.13117790e+00 9.94790385e+01
1716.lowfreq: -8.6435 -3.7921 0.0007 0.0010 0.0019 6.7128 19.7797 33.5978 41.8325
frequency: 19.4401 33.5771 41.8252 84.1759 120.7036 148.6391 152.7578 154.3423 166.2048 167.4266 183.4888 229.1466 245.5126 273.3884 302.1966 322.5758 366.5903 371.8144 423.5285 428.2322 430.9602 488.6675 524.4153 549.9446 553.7053 567.2044 578.5821 621.2232 693.9151 714.5129 762.6928 789.0977 808.2720 830.4594 865.9991 871.9389 901.5480 917.9952 920.3299 940.1265 961.9233 983.1547 1008.6793 1027.1752 1051.4557 1069.8885 1129.4124 1163.5748 1186.5131 1221.1369 1232.2995 1245.1961 1278.9486 1312.2206 1326.3451 1404.2267 1406.0197 1413.1621 1417.8870 1442.5647 1452.0757 1461.5553 1464.2844 1559.0825 1570.6062 1619.8439 1639.4156 2993.8310 3037.4679 3074.0758 3121.5686 3137.5337 3160.3088 3174.7251 3182.4597 3185.0794 3195.7844 3338.9598
redmass: 6.4504 5.7523 5.8670 6.0160 1.1215 2.4592 4.8775 2.1460 3.0156 4.5821 3.1560 4.4567 4.3473 4.8202 5.1484 8.3883 7.7362 5.5810 4.6178 4.5626 4.2402 5.1467 8.1377 5.2793 4.2778 3.9402 6.2810 5.2825 4.1422 5.3404 3.2436 5.1567 10.1698 1.5205 1.6380 1.4937 3.0692 4.5349 2.9891 1.5266 1.3572 1.2873 1.6537 1.8482 1.5257 2.3105 1.5174 4.0216 1.8494 1.3887 4.0521 1.7917 1.6605 1.1452 3.4836 1.3690 4.2446 1.0560 1.0579 4.2087 1.0436 1.0987 2.8414 8.0548 8.6211 7.3482 7.1215 1.0378 1.0247 1.0975 1.0990 1.0902 1.0919 1.0959 1.0928 1.1074 1.1078 1.0746
irintensity: 7.1332 3.5668 0.3988 1.0683 0.0128 3.7955 2.4866 5.5201 2.8683 8.8707 2.1129 3.9550 2.9333 17.8352 2.0537 38.1814 39.7496 5.7220 19.7920 4.2412 4.0661 3.5336 3.3009 19.7930 2.7815 4.3268 41.2403 1.3472 1.0127 3.1948 1.9450 33.5010 70.6609 35.4838 136.6365 23.8819 10.2518 39.9195 4.4970 3.4170 0.6864 44.3670 6.0047 41.2456 10.1794 10.7633 18.1851 65.8371 4.6853 13.6825 51.4599 2.2513 3.4966 3.5495 294.7181 34.8178 23.9187 8.7702 14.6792 26.3279 17.4132 13.3289 74.4947 81.1072 45.3757 25.4288 199.5570 8.2552 0.1725 8.1652 10.2824 4.3463 4.7322 2.8296 3.3127 0.1724 0.0602 12.2951
temp: 298.150 k
press: 1.00000 atm
elementType: 16 8 8 8 8 7 6 6 6 6 6 6 6 6 6 6 6 1 1 1 1 1 1 1 1 1 1 1
symmnumber: 1
zpe: 527658.4 jmol-1
zpe.correction: 0.200974 hartree
zpe.thermalcorrener: 0.218021 hartree
zpe.thermalcorrenthalpy: 0.218965 hartree
zpe.thermalcorrgfe: 0.154718 hartree
zpe.sumelectzpe: -1178.068827 hartree
zpe.sumelectthermal: -1178.051781 hartree
zpe.sumelectthermalent: -1178.050837 hartree
zpe.sumelectthermalfe: -1178.115083 hartree
dipole: 3.8058 -1.6496 -1.8779
dipole: 4.5532
quadrupole: -92.7584 -105.4612 -114.0950
quadrupole: -16.5942 12.2633 3.6292
quadrupole: 11.3465 -1.3563 -9.9902 -16.5942 12.2633 3.6292
hfenergy: -1178.2698015 hartree
pointgroup: C01 [X(C11H11N1O4S1)]
dipole: 1.5012113 0.9404334 0.2664161 debye
polarizability: 296.3918584|-0.9302798|141.4686713|4.249762|-37.0945053|131.8186636 unknown
InChI: InChI=1S/C11H11NO4S/c1-7-5-10(13)9-6-8(12-17(2,14)15)3-4-11(9)16-7/h3-6,12H,1-2H3
charge 0 multiplicity 1
28 atoms
S  -3.760082 0.081522 -0.523991
O  2.940989 0.968661 -0.562756
O  -5.038649 0.884506 -1.139845
O  -2.871454 -0.937184 -1.430161
O  1.132942 -1.524356 2.274095
N  -2.607565 1.502534 0.32546
C  0.902874 0.239006 0.62285
C  -1.216311 1.355885 0.070391
C  1.558007 1.06886 -0.325223
C  -0.486184 0.400658 0.814246
C  -0.52807 2.162494 -0.893201
C  0.855704 2.036506 -1.078052
C  1.678374 -0.768327 1.405347
C  3.689913 0.018334 0.154257
C  3.109766 -0.807809 1.086748
C  -4.31754 -0.844459 1.040307
C  5.13417 0.058333 -0.247101
H  -0.973203 -0.222162 1.571606
H  -1.091757 2.889061 -1.490472
H  -3.014963 2.336322 -0.146294
H  1.396721 2.652478 -1.801586
H  3.731051 -1.530763 1.620747
H  -3.413567 -1.29042 1.475419
H  -4.77215 -0.089049 1.693561
H  -5.035214 -1.602351 0.696339
H  5.715587 -0.677634 0.328964
H  5.55921 1.063678 -0.074132
H  5.2451 -0.164125 -1.324021
