program: Gaussian 09
title: 000278222
version: EM64L-G09RevD.01
frameworkgroup: C1[X(C12H20O)]
method: RPBEPBE
basis: SDD
operation: Freq
keyword: #pfreq=noraman
keyword: PBEPBE/SDD
title: #p freq=noraman PBEPBE/SDD
converged: NO YES NO NO
title: Mulliken charges:
elementType: O C C C C C C C C C C C C H H H H H H H H H H H H H H H H H H H H
charge: -0.198787 0.359235 0.240742 -0.471052 -0.473081 -0.466605 -0.413014 -0.426592 0.107908 -0.435071 -0.806441 -0.799905 -0.520708 0.194145 0.210458 0.207278 0.197059 0.222536 0.190034 0.199221 0.199396 0.236157 0.195716 0.221161 0.211667 0.225006 0.215081 0.222166 0.217654 0.234845 0.234487 0.244956 0.224349
chargesum: 0.00000
title: Mulliken charges with hydrogens summed into heavy atoms:
elementType: O C C C C C C C C C C C C
charge: -0.198787 0.359235 0.240742 -0.066449 -0.068743 -0.054036 -0.014397 0.005281 0.107908 -0.002243 -0.144187 -0.112919 -0.051404
polarizability: 1.27729284e+02 -2.49880819e+00 1.24521289e+02 3.48955926e-01 1.16668774e+00 1.14380657e+02
1716.lowfreq: -14.2525 -0.0006 -0.0005 0.0005 7.0215 32.3074 85.0925 117.5420 153.7832
frequency: 85.0342 117.4360 153.7107 184.3737 220.3369 237.7673 256.2090 269.6032 299.4350 321.1618 344.9717 353.2949 381.2225 393.1279 426.8872 441.8089 480.5707 503.9433 526.2067 575.3068 593.8585 685.7516 728.8013 776.6646 821.3795 836.9370 859.4576 872.3703 893.2500 917.6628 929.9523 945.4827 951.8611 999.8958 1008.3642 1023.9884 1044.9738 1055.2907 1068.1977 1099.8173 1108.1844 1138.2100 1147.9721 1154.4206 1177.0056 1189.6779 1211.3627 1234.5279 1243.9447 1270.7345 1284.0854 1289.4174 1307.5053 1332.9983 1334.6048 1341.9854 1344.1989 1350.2974 1350.9016 1379.9434 1389.9872 1447.1867 1449.8441 1458.2100 1463.9381 1470.6935 1475.2631 1480.1350 1484.3040 1485.5704 1488.6787 1494.3327 1611.8193 2960.3530 2965.6032 2973.2814 2974.2701 2977.9676 2979.2898 2984.8368 2990.1037 2994.2134 3014.8273 3019.0306 3029.1181 3041.3619 3047.2280 3054.6599 3061.9901 3066.3396 3072.8255 3084.4986 3090.7166
redmass: 6.0206 2.5247 1.4676 1.9173 2.4374 1.4224 1.6852 2.2038 2.1580 2.1790 2.3906 2.1859 2.3888 3.1565 2.8534 3.1758 3.0843 1.9896 3.1726 1.9829 3.7112 2.9374 2.4964 1.8696 1.8865 1.7879 1.8070 2.2165 1.7073 2.2181 1.7915 1.6162 1.7257 1.5249 1.8214 1.7476 1.7806 2.2286 1.6183 1.4751 2.0499 2.0933 2.1447 2.5008 1.7918 1.6999 1.8975 1.5469 2.2454 1.4100 1.4946 1.5248 1.4095 1.4103 1.3848 1.3969 1.4592 1.4187 1.4838 1.2002 1.1931 1.0828 1.0780 1.0785 1.0811 1.0761 1.0585 1.0807 1.0714 1.0572 1.0836 1.0594 9.8098 1.0589 1.0594 1.0641 1.0565 1.0520 1.0489 1.0408 1.0639 1.0641 1.0974 1.0980 1.1014 1.0974 1.1006 1.1022 1.0982 1.0974 1.0982 1.0979 1.0983
irintensity: 3.3941 0.4010 0.5547 0.6548 0.5168 0.0076 0.3785 0.1389 0.0996 1.6788 0.4598 2.7941 0.3387 1.2954 0.5954 1.4713 1.2152 0.0549 3.3847 2.6062 3.3448 2.1097 5.4109 0.2950 12.3816 0.3478 2.2817 1.1777 2.1131 0.3932 6.3533 3.5541 22.9345 5.2900 5.3692 10.0618 9.4295 6.2983 4.0726 1.7942 3.6978 3.2302 18.6002 3.7145 0.9571 3.3727 1.1581 6.6255 10.5900 2.4832 4.2738 1.6158 9.4071 1.0725 0.0836 0.2181 2.3005 2.7772 3.0546 17.0582 20.0102 23.4394 4.4131 4.5784 10.2640 15.9820 13.8151 10.8167 14.6175 3.8297 18.2985 1.8569 123.0388 28.4706 25.7601 11.6258 9.8484 33.7357 28.4325 60.5075 49.5542 24.5534 28.1870 71.6289 45.4430 26.7624 43.1866 45.2898 46.7466 32.7633 25.2059 31.9313 36.0663
temp: 298.150 k
press: 1.00000 atm
elementType: 8 6 6 6 6 6 6 6 6 6 6 6 6 1 1 1 1 1 1 1 1 1 1 1 1 1 1 1 1 1 1 1 1
symmnumber: 1
zpe: 774347.7 jmol-1
zpe.correction: 0.294933 hartree
zpe.thermalcorrener: 0.307550 hartree
zpe.thermalcorrenthalpy: 0.308494 hartree
zpe.thermalcorrgfe: 0.257992 hartree
zpe.sumelectzpe: -543.467935 hartree
zpe.sumelectthermal: -543.455319 hartree
zpe.sumelectthermalent: -543.454374 hartree
zpe.sumelectthermalfe: -543.504877 hartree
dipole: -0.4772 3.0085 0.8975
dipole: 3.1756
quadrupole: -77.6199 -89.8261 -79.5583
quadrupole: -2.0318 -0.3606 -2.8942
quadrupole: 4.7148 -7.4914 2.7765 -2.0318 -0.3606 -2.8942
hfenergy: -543.7628684 hartree
pointgroup: C01 [X(C12H20O1)]
dipole: -0.1199958 1.1856218 0.3752933 debye
polarizability: 127.4323122|-2.674449|124.7708922|0.3776444|1.3372887|114.4280255 unknown
InChI: InChI=1S/C12H20O/c1-11-7-3-4-9-12(11,2)10(13)6-5-8-11/h3-9H2,1-2H3
charge 0 multiplicity 1
33 atoms
O  -0.848146 -2.329559 -0.548802
C  0.234823 1.076589 0.167247
C  0.003353 -0.396198 0.727848
C  1.026314 0.986479 -1.178053
C  -1.126353 1.798437 -0.091429
C  1.33622 -1.200967 0.782336
C  2.366225 0.225481 -1.068408
C  2.12886 -1.208015 -0.543604
C  -1.033598 -1.145117 -0.157037
C  -2.096655 1.021687 -1.006654
C  1.033188 1.944908 1.177143
C  -0.608253 -0.392996 2.167173
C  -2.338213 -0.414139 -0.47825
H  1.196156 2.016374 -1.553143
H  0.405267 0.47056 -1.938587
H  -0.912299 2.791155 -0.536762
H  -1.625885 1.99782 0.878202
H  1.09961 -2.241819 1.071338
H  1.969236 -0.776079 1.58726
H  3.059875 0.76698 -0.394738
H  2.854463 0.192125 -2.061993
H  1.567946 -1.792083 -1.297416
H  3.09545 -1.726343 -0.391192
H  -1.698704 0.971222 -2.037638
H  -3.062991 1.557075 -1.070545
H  1.977913 1.471681 1.494634
H  1.287868 2.916915 0.712805
H  0.439883 2.157518 2.084706
H  -1.519795 0.223743 2.249759
H  -0.865218 -1.424401 2.472983
H  0.130906 -0.007956 2.891556
H  -2.911204 -1.029318 -1.193846
H  -2.931942 -0.357056 0.457908
