program: Gaussian 09
title: 000278254
version: EM64L-G09RevD.01
frameworkgroup: C1[X(C17H17NO2)]
method: RPBEPBE
basis: SDD
operation: Freq
keyword: #p
keyword: freq=noraman
keyword: PBEPBE/SDD
title: #p freq=noraman PBEPBE/SDD
converged: YES YES NO NO
title: Mulliken charges:
elementType: O O N C C C C C C C C C C C C C C C C C H H H H H H H H H H H H H H H H H
charge: -0.293219 -0.265271 -0.516106 0.407599 0.261450 0.451515 -0.347184 -0.414512 -0.510670 -0.440981 -0.368189 -0.231422 -0.232579 -0.231673 -0.196339 -0.216478 -0.255753 0.204638 -0.259277 -0.668326 0.316590 0.257017 0.258303 0.276070 0.230189 0.278367 0.230306 0.228817 0.230919 0.228091 0.229211 0.231574 0.230928 0.216117 0.210477 0.223935 0.245867
chargesum: 0.00000
title: Mulliken charges with hydrogens summed into heavy atoms:
elementType: O O N C C C C C C C C C C C C C C C C C
charge: -0.293219 -0.265271 -0.199516 0.407599 0.261450 0.451515 -0.090167 -0.156209 -0.234601 -0.210792 -0.089822 -0.001116 -0.003762 -0.000753 0.031752 0.012734 -0.024180 0.204638 0.187768 0.011953
polarizability: 2.93957292e+02 -9.07868031e+00 2.37338654e+02 2.38520086e+00 -6.19420484e+00 1.24236158e+02
1716.lowfreq: -1.6719 -0.0009 -0.0007 -0.0006 3.7441 5.7281 26.0127 35.7879 40.6562
frequency: 25.9454 35.7744 40.6176 49.1613 57.4218 72.4302 80.7054 100.5639 155.6253 188.9410 195.7171 223.5592 254.8482 261.4894 276.4583 327.0413 331.5288 402.8699 406.6038 407.8117 458.5988 495.3471 525.0394 568.7677 583.4540 612.6532 614.8384 625.9484 658.4148 682.7514 686.0697 699.0096 700.5562 754.2691 767.6027 773.6498 809.1986 820.5957 831.7173 850.3693 851.7329 868.1106 913.8963 929.6810 955.4840 970.6424 976.5011 984.6600 989.4213 991.2177 997.2264 1019.0551 1026.6744 1030.3954 1069.1579 1084.1581 1089.3740 1095.3433 1137.8380 1154.5408 1172.9212 1174.1127 1190.5571 1191.0982 1229.2041 1280.2268 1295.1219 1318.2816 1324.4689 1348.9098 1365.7669 1380.1692 1386.7418 1388.3020 1433.5220 1437.5528 1454.2136 1462.6637 1483.6757 1485.1370 1486.9834 1511.4141 1582.3093 1597.6565 1607.5930 1611.3609 1615.8412 1621.5829 2989.1122 3022.0435 3083.5302 3086.1843 3112.6477 3118.1317 3124.1039 3133.4566 3133.6643 3145.0778 3146.8560 3161.1402 3163.4626 3168.4710 3176.3540 3177.6851 3516.0996
redmass: 3.8640 3.9245 4.3500 4.2808 4.2672 4.0755 5.0936 4.2410 3.6768 3.6874 4.6380 1.6213 5.0631 3.2497 4.0163 3.6418 4.0164 3.5173 2.9530 3.0500 3.5456 2.9048 5.1052 4.4480 1.4125 5.8629 6.0177 4.1719 4.0345 5.3322 3.1617 2.5363 1.8787 1.9286 1.9475 3.0153 1.3280 2.4795 1.7008 2.1161 1.5956 1.4293 1.3972 1.4291 3.9091 1.3726 1.3936 5.7706 4.5366 1.3297 1.4000 3.1499 2.2142 2.8163 3.5772 1.6088 1.5949 2.1136 2.2352 1.6933 1.0510 1.0533 1.1126 1.1136 2.9172 1.1128 1.7402 1.3526 1.9849 1.3157 1.6737 7.8886 1.2857 4.5903 2.2359 2.2658 1.1026 1.0439 2.2713 1.0640 2.3589 1.9247 5.9451 5.5518 6.9676 5.9559 6.1657 6.1970 1.0360 1.0588 1.0987 1.1024 1.1049 1.0877 1.0857 1.0883 1.0868 1.0933 1.0931 1.0978 1.0949 1.0926 1.0984 1.0965 1.0755
irintensity: 0.4071 0.4338 0.7256 1.3608 0.1987 1.1924 0.4158 2.0825 0.6643 1.5724 0.9248 3.6623 1.0203 0.4337 3.1083 3.3206 17.7021 1.8385 1.0982 1.5168 4.8193 37.1811 4.3120 11.0090 77.0181 1.4128 2.9685 11.2465 8.9767 7.0714 3.6581 51.7007 41.2907 74.8334 25.5616 30.9695 3.5633 11.4649 9.2148 5.5798 1.4202 28.3744 4.2518 4.7102 122.2504 1.1782 1.6858 0.1850 0.5760 0.7099 0.0400 39.4301 19.9540 120.9519 386.5896 8.6482 47.0684 9.5514 87.6972 7.2647 0.4784 0.1276 3.0946 3.9367 26.9152 3.4832 28.9293 1.8439 86.8967 10.9442 5.5662 0.8538 40.8697 44.0914 6.0369 68.0985 30.4610 13.7922 22.8315 19.4876 100.2744 380.0383 47.7278 96.2387 389.8348 26.5301 29.3447 269.4466 30.6034 45.5095 38.8025 9.9139 39.1894 11.3777 2.7185 3.1044 0.3231 25.3519 24.8889 35.7537 30.8529 3.8699 7.6071 5.8998 22.9459
temp: 298.150 k
press: 1.00000 atm
elementType: 8 8 7 6 6 6 6 6 6 6 6 6 6 6 6 6 6 6 6 6 1 1 1 1 1 1 1 1 1 1 1 1 1 1 1 1 1
symmnumber: 1
zpe: 780231.3 jmol-1
zpe.correction: 0.297174 hartree
zpe.thermalcorrener: 0.315570 hartree
zpe.thermalcorrenthalpy: 0.316515 hartree
zpe.thermalcorrgfe: 0.248155 hartree
zpe.sumelectzpe: -861.779704 hartree
zpe.sumelectthermal: -861.761308 hartree
zpe.sumelectthermalent: -861.760364 hartree
zpe.sumelectthermalfe: -861.828724 hartree
dipole: -2.0133 -1.6007 0.9059
dipole: 2.7269
quadrupole: -106.9038 -101.4851 -117.4708
quadrupole: 1.0759 3.2608 -3.3672
quadrupole: 1.7161 7.1348 -8.8509 1.0759 3.2608 -3.3672
hfenergy: -862.0768788 hartree
pointgroup: C01 [X(C17H17N1O2)]
dipole: -0.7360225 -0.7210992 0.2988734 debye
polarizability: 293.6835654|-1.453613|235.9636558|16.90743|-6.1754733|125.8848818 unknown
InChI: InChI=1S/C17H17NO2/c1-2-20-17(19)13-16(14-9-5-3-6-10-14)18-15-11-7-4-8-12-15/h3-13,18H,2H2,1H3
charge 0 multiplicity 1
37 atoms
O  1.09057 3.209896 -0.163481
O  2.572434 1.433992 -0.552404
N  -1.196914 -0.938268 0.082531
C  0.061304 -0.319351 0.013847
C  1.177999 -1.315585 -0.005311
C  -2.497744 -0.414594 -0.159991
C  2.314988 -1.16364 0.829498
C  1.076115 -2.472274 -0.826157
C  0.195352 1.060725 0.013729
C  -3.596021 -1.053356 0.479346
C  -2.748571 0.652194 -1.065706
C  3.3245 -2.146889 0.844693
C  2.092849 -3.452437 -0.81678
C  3.21894 -3.294109 0.022516
C  -4.916946 -0.633237 0.221701
C  -4.074142 1.068149 -1.309121
C  -5.166115 0.436001 -0.669639
C  1.41042 1.825325 -0.255298
C  2.218058 4.152375 -0.392333
C  2.991449 4.406051 0.90693
H  -1.175441 -1.908067 0.408232
H  2.402522 -0.276719 1.462761
H  0.218431 -2.582911 -1.500337
H  -0.689472 1.677545 0.188477
H  -3.409434 -1.873507 1.184125
H  -1.921534 1.134201 -1.592963
H  4.196235 -2.017378 1.495039
H  2.009594 -4.330077 -1.467184
H  4.00871 -4.053577 0.03332
H  -5.750318 -1.136671 0.724097
H  -4.253042 1.8889 -2.012634
H  -6.190982 0.768655 -0.863915
H  2.880662 3.733757 -1.170765
H  1.727338 5.067839 -0.762294
H  3.769437 5.174668 0.739735
H  2.315162 4.764493 1.702512
H  3.487613 3.482085 1.248625
