program: Gaussian 09
title: 000278282
version: EM64L-G09RevD.01
frameworkgroup: C1[X(C17H17NO4)]
method: RPBEPBE
basis: SDD
operation: Freq
keyword: #p
keyword: freq=noraman
keyword: PBEPBE/SDD
title: #p freq=noraman PBEPBE/SDD
converged: YES YES NO NO
title: Mulliken charges:
elementType: O O O O N C C C C C C C C C C C C C C C C C H H H H H H H H H H H H H H H H H
charge: -0.268695 -0.264132 -0.464068 -0.318553 -0.355056 0.402301 0.277769 -0.766256 0.179401 -0.507384 0.177568 -0.513685 -0.444421 0.323115 -0.203108 -0.536910 0.484770 -0.439509 -0.363892 -0.216777 -0.226049 -0.238220 0.212265 0.307410 0.247942 0.256517 0.227487 0.199110 0.240723 0.232788 0.230576 0.271363 0.305788 0.231846 0.250579 0.376675 0.228579 0.230442 0.231698
chargesum: 0.00000
title: Mulliken charges with hydrogens summed into heavy atoms:
elementType: O O O O N C C C C C C C C C C C C C C C C C
charge: -0.268695 -0.264132 -0.087392 -0.318553 -0.049268 0.402301 0.277769 -0.246582 0.179401 -0.259442 0.177568 -0.257167 -0.017824 0.323115 0.270404 -0.034971 0.484770 -0.207663 -0.113314 0.011802 0.004393 -0.006522
polarizability: 2.81851630e+02 -4.11722762e+00 2.10626956e+02 -2.59982983e+01 3.69051361e+00 1.19154718e+02
1716.lowfreq: -7.9714 -3.5751 -0.0007 -0.0002 0.0004 1.3385 8.7233 20.6822 29.9804
frequency: 6.1050 20.5964 29.9644 36.8321 52.2388 76.5617 83.7372 131.0160 144.5228 169.5281 185.5711 216.2038 224.0105 266.1411 273.8404 310.9195 320.0338 354.9260 364.4951 402.5735 409.3628 424.5070 432.5603 481.3975 505.4431 571.7353 586.5625 616.2397 620.3600 629.1206 651.3143 675.9897 702.2416 706.1396 716.9040 730.7285 757.4711 777.5488 800.8763 807.9428 812.1665 837.9090 855.8456 860.1045 866.8119 888.0286 920.0426 940.1619 971.8931 979.0659 981.5560 990.1355 995.8418 998.3790 1009.2595 1026.0080 1032.4743 1052.8019 1069.8065 1088.4503 1125.3408 1141.3615 1157.6335 1173.4539 1175.5858 1187.8990 1213.1917 1217.9805 1229.5927 1238.7321 1255.4370 1278.2131 1305.4318 1322.9751 1336.0259 1352.9755 1361.3957 1386.0557 1405.7466 1409.6419 1423.0281 1441.6515 1443.2635 1466.8355 1469.8507 1475.6933 1485.2260 1486.2467 1498.6921 1592.7210 1595.9195 1614.8467 1622.8356 1625.0684 2932.1316 2996.1413 2996.2625 2999.6643 3000.8804 3058.6336 3068.7974 3106.3654 3116.2393 3124.8580 3136.0399 3148.0270 3154.8246 3158.1271 3165.0191 3177.4982 3550.2394
redmass: 5.0803 5.0026 4.3741 4.4423 5.1208 3.7934 3.1150 3.8579 6.4662 6.4913 4.4552 5.9953 6.6615 4.9223 3.9819 4.7182 6.6734 2.4803 5.5374 2.8046 3.6720 3.8745 3.0786 4.2202 3.4855 2.7949 3.9051 6.2399 2.9715 1.8457 5.5947 9.1152 4.4993 1.9755 5.9711 3.9698 1.8625 3.7303 1.1847 4.0391 3.6057 9.7189 1.2560 1.8685 1.4945 2.1558 1.4183 2.0838 5.8144 1.3944 3.6013 6.0637 1.9562 1.3681 2.3721 2.2214 6.4808 3.9889 1.4892 1.5624 1.1115 2.1314 1.7291 1.0547 1.7471 1.1128 2.4975 1.1879 1.2358 1.3671 3.5967 1.6996 1.4165 1.3468 1.4404 1.4125 1.2807 6.1060 1.2897 4.2038 2.8548 1.8301 1.2258 1.5059 1.1753 1.2814 2.0399 1.4955 1.9458 5.9567 6.0952 6.0278 7.8114 9.3079 1.0657 1.0791 1.0763 1.0603 1.0607 1.1005 1.1019 1.1110 1.0876 1.0865 1.0913 1.0961 1.0922 1.0925 1.1015 1.0714 1.0778
irintensity: 0.2058 0.5152 0.3715 3.8506 0.2252 12.6055 10.9628 7.9663 4.5135 1.6478 2.2578 0.1539 6.0889 0.5135 15.1518 10.6883 6.3171 14.4485 0.4942 0.8867 14.6360 1.3353 5.8071 25.0733 17.3400 12.7248 4.5334 1.7267 53.4408 54.9816 6.7915 0.1146 5.7554 44.5611 0.1923 10.2348 55.9502 33.5547 323.5433 31.5195 4.3135 17.7817 0.1190 2.8331 25.9136 18.4931 4.5410 9.0410 169.3694 0.0568 14.5152 0.2920 27.9044 3.3208 5.5134 14.3414 34.1551 6.7362 8.0564 16.0848 0.4957 1.5525 47.2377 0.1378 33.8779 0.4757 1.7269 20.6046 36.6652 22.2872 256.4858 23.9082 18.9211 17.7605 3.0676 7.3096 0.4052 4.7868 61.8796 1.5588 12.2565 25.9537 18.3595 125.1260 32.7729 68.4218 1.2637 83.2318 195.6527 181.6173 26.7929 5.4908 0.0788 0.3223 112.6446 64.0653 8.0168 135.0124 24.5840 10.2468 3.2886 32.3837 8.6933 2.4421 11.6262 37.2560 6.3719 2.3552 29.5071 529.7102 22.0198
temp: 298.150 k
press: 1.00000 atm
elementType: 8 8 8 8 7 6 6 6 6 6 6 6 6 6 6 6 6 6 6 6 6 6 1 1 1 1 1 1 1 1 1 1 1 1 1 1 1 1 1
symmnumber: 1
zpe: 806625.8 jmol-1
zpe.correction: 0.307228 hartree
zpe.thermalcorrener: 0.326692 hartree
zpe.thermalcorrenthalpy: 0.327636 hartree
zpe.thermalcorrgfe: 0.254961 hartree
zpe.sumelectzpe: -1012.048884 hartree
zpe.sumelectthermal: -1012.029420 hartree
zpe.sumelectthermalent: -1012.028475 hartree
zpe.sumelectthermalfe: -1012.101150 hartree
dipole: -1.3711 -4.5029 1.5734
dipole: 4.9631
quadrupole: -108.7251 -130.5599 -130.2905
quadrupole: -0.0630 -6.2669 5.2434
quadrupole: 14.4667 -7.3681 -7.0987 -0.0630 -6.2669 5.2434
hfenergy: -1012.3561114 hartree
pointgroup: C01 [X(C17H17N1O4)]
dipole: 0.4909324 1.4909791 1.1613275 debye
polarizability: 279.4193013|-13.1718126|204.0327528|30.3057626|23.4099766|128.1812503 unknown
InChI: InChI=1S/C17H17NO4/c19-10-14-7-16-15(21-11-22-16)6-13(14)8-17(20)18-9-12-4-2-1-3-5-12/h1-7,18-19H,8-11H2
charge 0 multiplicity 1
39 atoms
O  -4.169107 2.172157 1.052297
O  -5.545886 0.877522 -0.42968
O  -0.761963 -3.087091 -1.189748
O  0.704708 -0.836904 -1.381098
N  1.614111 0.398741 0.356599
C  -1.73736 -0.671325 0.477461
C  -2.55451 -1.446504 -0.397596
C  -0.311249 -1.078656 0.853991
C  -3.4845 1.001442 0.632874
C  -2.213286 0.570755 1.000946
C  -4.291581 0.241064 -0.236048
C  -3.852973 -0.971221 -0.761885
C  -2.174123 -2.82609 -0.957804
C  0.705753 -0.502435 -0.146369
C  -5.409777 2.202999 0.230508
C  2.661617 1.031708 -0.471318
C  4.070887 0.703053 0.009623
C  4.97957 1.736417 0.344083
C  4.495376 -0.647302 0.112259
C  6.292474 1.430117 0.772519
C  5.803957 -0.955435 0.541468
C  6.70737 0.083138 0.873192
H  -0.080165 -0.730124 1.877302
H  -0.203236 -2.176563 0.818507
H  -1.592866 1.167371 1.676512
H  -4.488301 -1.550249 -1.4391
H  -2.493962 -3.611335 -0.244067
H  -2.755602 -2.983609 -1.892556
H  -6.274299 2.364196 0.892727
H  -5.30606 2.983613 -0.546684
H  2.508709 2.127668 -0.482463
H  2.491138 0.656463 -1.496873
H  1.601742 0.606643 1.356731
H  4.662142 2.784149 0.266809
H  3.799751 -1.452971 -0.151837
H  -0.29044 -2.262775 -1.537214
H  6.986741 2.238752 1.026993
H  6.122637 -2.0014 0.612302
H  7.723763 -0.156576 1.204834
