program: Gaussian 09
title: 000278214
version: EM64L-G09RevD.01
frameworkgroup: C1[X(C11H16O)]
method: RPBEPBE
basis: SDD
operation: Freq
keyword: #pfreq=noraman
keyword: PBEPBE/SDD
title: #p freq=noraman PBEPBE/SDD
converged: YES YES NO NO
title: Mulliken charges:
elementType: O C C C C C C C C C C C H H H H H H H H H H H H H H H H
charge: -0.220765 0.325245 -0.151537 -0.459270 -0.450263 -0.592561 -0.419625 -0.389614 -0.755596 -0.159510 0.130271 -0.323810 0.206917 0.203096 0.201041 0.206889 0.222577 0.244036 0.240091 0.206592 0.204658 0.190164 0.210182 0.207874 0.234866 0.216011 0.222310 0.249730
chargesum: 0.00000
title: Mulliken charges with hydrogens summed into heavy atoms:
elementType: O C C C C C C C C C C C
charge: -0.220765 0.325245 0.055380 -0.055133 -0.020798 -0.108433 -0.008375 0.010732 -0.096845 0.062799 0.130271 -0.074080
polarizability: 1.35813046e+02 4.59319114e+00 1.08098189e+02 6.38048756e+00 7.15515968e+00 9.75433343e+01
1716.lowfreq: -19.4113 -0.0006 0.0006 0.0007 3.8800 26.9465 70.3543 138.9803 161.8385
frequency: 70.3196 138.9491 161.8311 197.8891 217.5502 261.6393 282.6463 316.2842 348.4716 387.3587 406.0949 432.4813 466.0109 484.7810 500.4159 538.1669 605.6337 649.5431 752.3636 771.7425 807.6417 840.4898 852.7776 858.4281 907.2860 913.9557 940.3816 952.2222 988.1922 995.8879 1006.3886 1029.3411 1054.2312 1082.4772 1098.2444 1121.4898 1137.0500 1148.7727 1181.3205 1204.5940 1228.2362 1257.2554 1262.5008 1265.2693 1284.1948 1298.5130 1320.7186 1331.2550 1336.8547 1345.4917 1351.4835 1374.8158 1389.4874 1434.7321 1456.4732 1465.6947 1466.7927 1474.1267 1479.3625 1481.2282 1582.5541 1625.1630 2951.3959 2955.6119 2968.4367 2972.8038 2974.3006 2975.6066 2978.6739 3015.3068 3029.3580 3032.2761 3043.6083 3048.5599 3063.5997 3081.6279 3095.0546 3146.8224
redmass: 5.0805 2.6566 2.5123 2.8314 1.1207 2.6216 2.7721 2.1256 2.0329 2.1070 3.2743 3.1872 3.9811 3.2802 3.7310 1.8145 2.9196 4.7562 2.1233 1.5713 2.2748 1.8818 2.2243 2.5273 1.6597 2.0422 2.1716 1.8999 1.5665 1.4634 2.0374 1.6176 2.1233 1.7200 1.5167 1.5354 1.4333 1.8475 1.8990 1.4832 1.4419 1.7995 1.4737 1.4365 1.4993 1.7381 1.3231 1.5861 1.4390 1.4877 1.5991 1.7682 1.2195 1.0812 1.0829 1.0817 1.0839 1.0661 1.0880 1.0564 9.5128 6.9429 1.0784 1.0646 1.0617 1.0456 1.0587 1.0591 1.0609 1.0980 1.0968 1.1011 1.1030 1.0970 1.0987 1.0986 1.0878 1.0967
irintensity: 3.9071 0.4376 0.7013 1.0925 0.1112 0.6396 0.5829 0.3611 0.5710 2.6405 1.3602 0.8252 7.6702 1.4898 2.9950 3.1403 2.5772 1.3194 6.1269 17.1807 1.3567 13.0775 8.0719 6.6950 6.6213 1.2515 3.5901 3.3344 7.0675 1.3052 11.2509 1.6888 1.9938 2.4623 0.5501 0.6080 13.9135 6.8466 2.2670 6.7733 3.0753 27.2035 14.2861 0.2895 9.2647 4.5695 0.1414 2.4285 1.5491 0.1045 4.4006 23.2634 18.0943 8.4578 4.8994 8.5345 11.6650 9.0037 13.0991 5.9090 141.9999 97.3931 12.0083 37.9741 34.2981 25.2612 31.2365 27.1361 19.7491 40.4093 51.5191 35.2265 74.3238 20.2299 39.6705 28.5438 19.0404 18.2357
temp: 298.150 k
press: 1.00000 atm
elementType: 8 6 6 6 6 6 6 6 6 6 6 6 1 1 1 1 1 1 1 1 1 1 1 1 1 1 1 1
symmnumber: 1
zpe: 639742.5 jmol-1
zpe.correction: 0.243665 hartree
zpe.thermalcorrener: 0.254613 hartree
zpe.thermalcorrenthalpy: 0.255557 hartree
zpe.thermalcorrgfe: 0.207956 hartree
zpe.sumelectzpe: -503.059369 hartree
zpe.sumelectthermal: -503.048422 hartree
zpe.sumelectthermalent: -503.047477 hartree
zpe.sumelectthermalfe: -503.095078 hartree
dipole: 4.1674 1.2842 1.7350
dipole: 4.6933
quadrupole: -86.1611 -70.0357 -74.1448
quadrupole: -3.7199 -5.9392 0.6280
quadrupole: -9.3805 6.7448 2.6357 -3.7199 -5.9392 0.6280
hfenergy: -503.3030345 hartree
pointgroup: C01 [X(C11H16O1)]
dipole: 1.6400804 0.5656511 0.6321596 debye
polarizability: 135.8084458|5.5407611|108.8385155|5.3191465|6.7696607|96.8076086 unknown
InChI: InChI=1S/C11H16O/c1-11-7-3-2-4-9(11)5-6-10(12)8-11/h5-6,9H,2-4,7-8H2,1H3
charge 0 multiplicity 1
28 atoms
O  -3.111579 -0.625971 -1.05965
C  0.277221 -0.710604 0.482975
C  0.465485 0.826914 0.725217
C  1.653296 -1.382937 0.1889
C  1.359122 1.5222 -0.357502
C  -0.705919 -0.926962 -0.704739
C  2.502909 -0.67689 -0.890999
C  2.717741 0.809113 -0.530425
C  -0.31134 -1.377057 1.756505
C  -0.862124 1.556121 0.789262
C  -2.037198 -0.184827 -0.548188
C  -2.004296 1.098532 0.193343
H  0.989264 0.953432 1.697718
H  1.478121 -2.440988 -0.092217
H  2.236703 -1.40384 1.13393
H  1.508637 2.582384 -0.07376
H  0.820575 1.529948 -1.325788
H  -0.925989 -2.001587 -0.844461
H  -0.251034 -0.573538 -1.653187
H  2.007152 -0.745646 -1.880474
H  3.47638 -1.194246 -0.99162
H  3.298599 0.880713 0.412345
H  3.310199 1.318597 -1.314514
H  0.356647 -1.218168 2.624248
H  -1.306734 -0.976862 2.016348
H  -0.414975 -2.468053 1.605846
H  -0.875941 2.523803 1.311928
H  -2.947023 1.656719 0.238959
