program: Gaussian 09
title: 000278260
version: EM64L-G09RevD.01
frameworkgroup: C1[X(C16H15NO4)]
method: RPBEPBE
basis: SDD
operation: Freq
keyword: #p
keyword: freq=noraman
keyword: PBEPBE/SDD
title: #p freq=noraman PBEPBE/SDD
converged: YES YES NO NO
title: Mulliken charges:
elementType: O O O O N C C C C C C C C C C C C C C C C H H H H H H H H H H H H H H H
charge: -0.266675 -0.262542 -0.462696 -0.207637 -0.730222 -0.348496 -0.669593 0.570841 0.424181 -0.488696 -0.439425 0.186242 0.152982 0.159033 0.270036 -0.336401 -0.399055 -0.205176 -0.423699 -0.277681 -0.215829 0.288362 0.256875 0.241535 0.280520 0.236562 0.251866 0.228211 0.231934 0.239905 0.210268 0.224199 0.219710 0.378543 0.296465 0.385553
chargesum: 0.00000
title: Mulliken charges with hydrogens summed into heavy atoms:
elementType: O O O O N C C C C C C C C C C C C C C C C
charge: -0.266675 -0.262542 -0.077143 -0.207637 -0.055214 -0.060134 -0.171182 0.570841 0.424181 -0.208176 -0.202863 0.186242 0.152982 0.159033 0.270036 -0.084535 -0.170845 0.266663 -0.213431 -0.053482 0.003881
polarizability: 2.44423893e+02 -5.04365294e+00 2.00624025e+02 -3.04418187e+01 -6.08361096e+00 1.27677562e+02
1716.lowfreq: -5.8010 -4.9299 -0.0010 -0.0008 -0.0006 4.1108 17.3174 28.6997 39.4170
frequency: 17.0723 28.5770 39.4042 49.2052 70.4908 91.7275 102.7923 131.1720 160.6445 164.9888 203.5706 239.1331 281.9393 300.3707 318.8318 345.7196 376.0540 406.5157 416.8348 422.1788 435.1602 463.0289 520.1815 528.0109 538.3212 562.8375 580.2376 585.9157 600.1423 617.2099 633.7875 676.3892 682.7388 720.5934 733.1706 749.6104 752.8239 768.5228 786.2246 808.6154 835.8081 839.7013 848.8241 870.9100 886.2955 906.1277 925.3491 933.6016 947.9537 966.8727 967.1191 977.3349 1015.0839 1029.8949 1053.0834 1065.6282 1070.7999 1125.7960 1128.4029 1130.8269 1170.9261 1174.3707 1196.0427 1206.8300 1225.2437 1245.0854 1263.4641 1277.3277 1297.5280 1315.0116 1316.7922 1348.4476 1365.2445 1393.0331 1417.5222 1441.9678 1451.4062 1472.6710 1478.2335 1486.2188 1499.1660 1587.1660 1612.5284 1621.7941 1631.4520 1668.4193 1678.5844 2980.3021 2996.8153 3022.8938 3064.8119 3106.6430 3110.4298 3119.4544 3136.8768 3141.7959 3163.1249 3181.9569 3186.5845 3508.6362 3517.5905 3663.6986
redmass: 5.2692 5.7189 6.2745 7.1249 3.4164 3.6101 5.3818 6.0928 5.2561 6.2242 5.5696 5.8081 5.8549 7.5129 3.9227 3.4161 3.8094 1.1650 3.1554 3.1949 3.3862 3.3157 3.9158 4.3020 1.5374 2.2221 1.9964 4.9582 3.4986 2.7153 4.9520 8.4523 4.3053 3.9718 3.0086 4.1268 1.4371 5.5259 5.1367 1.4484 5.3561 3.0510 1.8465 1.7414 2.7083 4.3488 1.4714 1.7103 2.7434 1.3977 2.8820 4.6723 1.9211 2.3608 2.0742 2.7735 1.4997 1.2363 1.2343 1.3986 1.0897 1.2040 1.5194 2.5206 1.4379 2.3618 1.6328 1.4216 1.4168 1.7881 1.5032 2.3508 1.3352 6.2733 2.5531 4.2535 2.4232 1.2789 1.6137 1.5825 2.8609 6.5610 7.7261 6.0290 8.2502 1.1882 7.1637 1.0648 1.0611 1.0836 1.0975 1.1100 1.0867 1.0890 1.0931 1.0901 1.0998 1.0952 1.0936 1.0495 1.0641 1.1008
irintensity: 0.1750 0.6241 1.0620 1.0964 7.7925 6.2404 3.4580 0.6319 1.2499 0.6756 0.9793 1.0794 2.5861 0.1129 1.3319 3.1529 4.2601 109.3515 11.0910 0.1935 2.4699 1.3413 37.2674 20.2541 17.6082 47.1202 96.3227 8.5886 51.9662 94.4605 17.8570 3.1197 22.6612 6.6773 11.0357 10.2372 78.0246 8.2853 8.6894 34.5456 24.7247 6.1047 6.1458 6.4251 18.9740 9.6383 7.4399 6.1430 68.3717 17.2336 78.4352 74.9831 58.4461 173.2512 6.3306 16.6455 7.6723 17.2171 16.6971 2.5171 3.0209 19.3143 33.1904 4.3481 5.6998 128.6672 57.1313 31.4371 4.1749 23.8047 13.6576 25.8135 1.4444 10.8748 12.0063 71.2742 21.9888 31.1878 68.7541 69.7949 66.5976 11.5373 4.1261 52.9766 0.1009 156.3410 261.8545 27.3730 136.2216 2.5165 14.0707 30.6502 17.5638 5.4015 34.8909 8.9437 25.8274 3.3245 0.6296 133.0837 33.3069 59.1049
temp: 298.150 k
press: 1.00000 atm
elementType: 8 8 8 8 7 6 6 6 6 6 6 6 6 6 6 6 6 6 6 6 6 1 1 1 1 1 1 1 1 1 1 1 1 1 1 1
symmnumber: 1
zpe: 730800.2 jmol-1
zpe.correction: 0.278347 hartree
zpe.thermalcorrener: 0.296846 hartree
zpe.thermalcorrenthalpy: 0.297790 hartree
zpe.thermalcorrgfe: 0.229464 hartree
zpe.sumelectzpe: -972.834965 hartree
zpe.sumelectthermal: -972.816466 hartree
zpe.sumelectthermalent: -972.815522 hartree
zpe.sumelectthermalfe: -972.883849 hartree
dipole: -1.5195 1.3237 1.0750
dipole: 2.2840
quadrupole: -106.4205 -116.3160 -122.1452
quadrupole: -12.9301 -7.9231 2.0780
quadrupole: 8.5401 -1.3554 -7.1847 -12.9301 -7.9231 2.0780
hfenergy: -973.1133124 hartree
pointgroup: C01 [X(C16H15N1O4)]
dipole: -0.5924928 0.5230648 0.4275721 debye
polarizability: 241.7046646|-5.666606|199.6471257|-35.1972974|-9.7933244|131.3736891 unknown
InChI: InChI=1S/C16H15NO4/c17-13-4-2-1-3-11(13)7-12(16(18)19)10-5-6-14-15(8-10)21-9-20-14/h1-6,8,12,18H,7,9,17H2
charge 0 multiplicity 1
36 atoms
O  4.189601 0.16397 -1.314463
O  4.488134 -1.432344 0.450972
O  -1.741053 3.348271 0.282989
O  0.446081 3.493312 -0.476595
N  -3.773107 0.973952 0.670933
C  -0.550493 1.273225 0.150156
C  -1.432203 0.65517 -1.029593
C  0.798954 0.581624 0.27761
C  -2.257084 -0.528829 -0.567717
C  1.845372 0.827149 -0.663004
C  0.983095 -0.368107 1.312986
C  3.028739 0.110093 -0.497752
C  -0.4816 2.7790 -0.050518
C  3.206183 -0.830007 0.540322
C  -3.407297 -0.313312 0.263677
C  2.195015 -1.097077 1.463681
C  -1.918613 -1.849686 -0.940622
C  5.200474 -0.65965 -0.602252
C  -4.183466 -1.436248 0.673114
C  -2.687922 -2.961167 -0.529477
C  -3.827268 -2.741112 0.280016
H  -1.119569 1.118129 1.085148
H  -0.747286 0.359017 -1.842349
H  -2.096561 1.444593 -1.434083
H  1.738736 1.566897 -1.459302
H  0.164752 -0.555237 2.01675
H  2.327582 -1.83101 2.262089
H  -1.032929 -2.003689 -1.569576
H  5.937842 0.010076 -0.120034
H  5.657642 -1.363012 -1.315006
H  -5.068591 -1.276292 1.302339
H  -2.407584 -3.974148 -0.835137
H  -4.441067 -3.588181 0.607954
H  -3.222956 1.804282 0.449365
H  -4.60298 1.096799 1.244682
H  -1.713171 4.328448 0.113395
