program: Gaussian 09
title: 000278267
version: EM64L-G09RevD.01
frameworkgroup: C1[X(C17H12O4)]
method: RPBEPBE
basis: SDD
operation: Freq
keyword: #pfreq=noraman
keyword: PBEPBE/SDD
title: #p freq=noraman PBEPBE/SDD
converged: YES YES NO NO
title: Mulliken charges:
elementType: O O O O C C C C C C C C C C C C C C C C C H H H H H H H H H H H H
charge: -0.300546 -0.255906 -0.295133 -0.266640 0.152073 0.328834 0.181647 0.007704 0.499716 0.043345 0.158857 -0.664628 -0.396667 -0.380340 -0.372471 -0.463568 -0.197123 -0.249816 0.164214 -0.248245 -0.498579 0.283739 0.313039 0.254792 0.301016 0.250189 0.232062 0.241574 0.229864 0.232253 0.241527 0.242278 0.230938
chargesum: 0.00000
title: Mulliken charges with hydrogens summed into heavy atoms:
elementType: O O O O C C C C C C C C C C C C C C C C C
charge: -0.300546 -0.255906 -0.295133 -0.266640 0.152073 0.328834 0.181647 0.007704 0.499716 0.043345 0.158857 -0.380889 -0.083629 -0.125547 -0.071455 -0.213379 0.276512 -0.019952 0.164214 -0.015992 0.216164
polarizability: 2.75560477e+02 4.04095560e+00 2.91256092e+02 5.62142989e-01 1.22962984e-02 8.32907841e+01
1716.lowfreq: -6.9378 -1.7403 -0.0014 -0.0010 -0.0009 4.3871 23.2726 54.4918 70.4462
frequency: 23.2297 54.4839 70.4429 88.6689 104.6346 113.2181 132.9594 150.2698 179.4983 181.2191 259.4264 271.1610 288.1280 292.9482 307.3075 331.5784 364.3646 399.8394 439.3838 462.5725 482.5084 543.9280 565.5531 577.7854 596.7641 627.6700 637.6781 651.3228 695.2262 709.1173 718.4407 740.4347 748.9014 775.1802 811.1228 822.9770 836.7659 842.7080 846.7727 887.4022 906.3573 923.7914 952.0970 977.5285 979.1280 980.0213 1000.6461 1024.9961 1034.6361 1065.5997 1073.6469 1113.7011 1120.2002 1131.4859 1142.9265 1148.2757 1164.7115 1182.3980 1219.7229 1250.8183 1265.4799 1272.7393 1310.0877 1363.2177 1375.4906 1392.7964 1400.9745 1421.5727 1428.0920 1441.9580 1443.3336 1450.7658 1464.7027 1481.5991 1500.4319 1542.2539 1582.5882 1590.0079 1613.2147 1620.6319 1629.1370 2993.6521 3002.6110 3103.6128 3107.9677 3125.8265 3138.4275 3145.0286 3160.7626 3169.2361 3176.7903 3192.0110 3194.4610
redmass: 6.1192 3.9980 3.4670 4.5532 2.4491 1.3719 4.1828 3.5786 5.7261 6.1129 5.8854 7.8145 5.1968 4.9492 5.0905 6.2199 8.2487 6.7453 3.5031 6.4721 4.5266 3.5880 7.5278 4.1173 6.9759 5.7598 5.5856 6.8866 7.2929 8.6252 6.1589 6.5999 3.2543 1.5000 2.7406 6.2789 1.6632 6.6994 5.8841 1.4857 6.3949 7.2513 1.5516 3.5487 1.4680 1.6341 1.3490 6.0225 2.9521 3.3004 1.5149 1.2617 2.2477 1.0753 1.5070 1.4176 2.7973 1.1869 1.5435 2.0209 3.5636 2.3619 1.8702 1.5783 3.2732 3.9925 3.3885 1.3751 2.0776 3.1496 4.7433 1.0503 1.0532 1.1326 2.9952 5.6930 7.8625 7.1826 8.0150 6.3290 9.2648 1.0617 1.0295 1.1044 1.1092 1.0865 1.0910 1.1047 1.0984 1.0913 1.0901 1.0944 1.0961
irintensity: 1.5288 1.1988 1.1004 3.3664 9.3435 3.3456 1.5262 5.9539 0.5981 0.7166 3.5365 2.6169 0.2200 9.7514 2.3321 2.5064 9.4412 4.5613 5.6180 9.7266 1.7001 7.9737 2.1499 1.1744 4.0960 4.6717 6.5823 6.1750 2.4953 0.6127 5.1700 4.2958 11.2829 69.0682 1.1310 24.2878 50.1927 3.1429 37.7094 3.7356 9.1859 10.1659 7.8692 155.4730 24.2554 38.8207 0.1112 60.2906 2.4232 24.2035 8.9764 0.2138 83.1784 1.4940 163.0095 10.8798 232.4703 43.3998 49.5611 237.3309 3.0692 16.1852 6.5778 0.2503 2.4496 46.2521 7.0068 18.4756 93.2426 21.5917 23.0169 13.6446 12.6237 2.9777 48.1089 27.0767 34.3123 7.2549 214.2163 5.7249 14.9582 131.7442 48.2098 27.0026 29.7004 1.1391 15.6990 15.7793 35.6454 0.0354 5.2008 8.2173 17.9483
temp: 298.150 k
press: 1.00000 atm
elementType: 8 8 8 8 6 6 6 6 6 6 6 6 6 6 6 6 6 6 6 6 6 1 1 1 1 1 1 1 1 1 1 1 1
symmnumber: 1
zpe: 646747.5 jmol-1
zpe.correction: 0.246333 hartree
zpe.thermalcorrener: 0.263253 hartree
zpe.thermalcorrenthalpy: 0.264197 hartree
zpe.thermalcorrgfe: 0.200753 hartree
zpe.sumelectzpe: -954.453547 hartree
zpe.sumelectthermal: -954.436628 hartree
zpe.sumelectthermalent: -954.435683 hartree
zpe.sumelectthermalfe: -954.499128 hartree
dipole: 0.4756 2.0958 0.3869
dipole: 2.1836
quadrupole: -91.3346 -115.9298 -123.9778
quadrupole: -2.6020 1.7930 -0.3737
quadrupole: 19.0795 -5.5157 -13.5637 -2.6020 1.7930 -0.3737
hfenergy: -954.6998804 hartree
pointgroup: C01 [X(C17H12O4)]
dipole: -0.2983796 -0.7835566 0.1871886 debye
polarizability: 275.9942644|6.7014304|289.076588|12.1006486|-13.8265926|85.0365005 unknown
InChI: InChI=1S/C17H12O4/c1-19-17(18)13-8-10-4-2-3-5-11(10)15-12(13)6-7-14-16(15)21-9-20-14/h2-8H,9H2,1H3
charge 0 multiplicity 1
33 atoms
O  -3.29726 0.68806 -0.249934
O  -3.123494 3.062518 -0.431568
O  4.072342 -0.241552 0.345064
O  3.369842 1.958729 0.209923
C  -0.796792 0.248055 -0.012336
C  0.490179 0.939606 0.027461
C  -0.876196 -1.208717 0.084833
C  -1.929602 1.086441 -0.150468
C  0.349164 -1.951681 0.232876
C  1.702296 0.126989 0.179894
C  -1.84212 2.480118 -0.256685
C  1.604897 -1.258142 0.277701
C  0.542575 2.365802 -0.085321
C  -0.614127 3.153689 -0.23257
C  -2.10472 -1.938737 0.039017
C  0.314763 -3.377064 0.333266
C  -4.078366 1.95257 -0.208913
C  -2.114118 -3.339056 0.139335
C  3.067645 0.737296 0.240929
C  -0.900782 -4.068635 0.287833
C  5.454023 0.281157 0.418276
H  2.521233 -1.84306 0.391992
H  1.518964 2.850074 -0.048742
H  -0.561799 4.241211 -0.3224
H  -3.04622 -1.399844 -0.07716
H  1.260681 -3.919622 0.44543
H  -4.535305 2.059433 0.793692
H  -4.819325 1.941238 -1.022658
H  -3.068449 -3.876019 0.101171
H  -0.921939 -5.160887 0.3642
H  5.577027 0.920009 1.309129
H  5.689359 0.872741 -0.482441
H  6.087824 -0.614718 0.482075
