program: Gaussian 09
title: 000278208
version: EM64L-G09RevD.01
frameworkgroup: C1[X(C11H16O)]
method: RPBEPBE
basis: SDD
operation: Freq
keyword: #pfreq=noraman
keyword: PBEPBE/SDD
title: #p freq=noraman PBEPBE/SDD
converged: YES YES NO NO
title: Mulliken charges:
elementType: O C C C C C C C C C C C H H H H H H H H H H H H H H H H
charge: -0.229233 -0.500564 -0.419690 0.144695 0.288132 -0.494928 0.061580 -0.556105 -0.832399 -0.461940 -0.017873 -0.601161 0.222390 0.224643 0.212002 0.216234 0.249470 0.222953 0.248051 0.220567 0.238323 0.249623 0.232512 0.235471 0.200823 0.217983 0.214616 0.213825
chargesum: 0.00000
title: Mulliken charges with hydrogens summed into heavy atoms:
elementType: O C C C C C C C C C C C
charge: -0.229233 -0.053530 0.008546 0.144695 0.288132 -0.022505 0.061580 -0.087487 -0.111941 -0.025646 0.200110 -0.172720
polarizability: 1.47751196e+02 -8.99719615e-01 1.32786832e+02 -3.78443566e+00 5.14902628e+00 8.20678350e+01
1716.lowfreq: -12.4440 0.0003 0.0006 0.0006 6.9909 11.9017 39.6187 57.5418 70.0668
frequency: 39.4348 57.5312 69.9799 91.2604 109.4743 123.3004 140.7190 228.0235 247.9312 311.2066 346.5994 364.0294 418.1834 421.1762 470.9546 496.8202 525.3908 550.2564 610.1632 661.9285 729.7786 756.9590 835.2970 856.6970 880.7560 904.8466 927.1180 939.1658 977.7456 993.4719 1007.2103 1016.9557 1028.9288 1064.3993 1072.7118 1118.9833 1132.7729 1138.3234 1188.2919 1192.3644 1212.9205 1245.1416 1257.5711 1276.1607 1291.7444 1313.2639 1318.3280 1326.9041 1350.8569 1357.8648 1391.5365 1425.0781 1438.2351 1448.9340 1452.5851 1460.7268 1464.4888 1472.6819 1487.4837 1569.5069 1637.2919 1657.1783 2941.1245 2965.5319 2966.5756 2974.5460 2988.9958 3007.1139 3009.9579 3029.1061 3034.1416 3051.3152 3065.1157 3067.8573 3076.1696 3089.5437 3108.8291 3191.7333
redmass: 3.8125 3.1061 2.4796 2.2116 2.5501 1.3181 2.5913 2.1025 2.6669 2.4840 2.3181 2.6179 2.1395 3.4295 3.9725 3.9492 3.5717 2.1328 2.2818 2.2510 2.8836 1.3367 1.6106 1.8629 2.3418 2.3790 1.7315 1.3351 1.5898 1.5332 1.1660 3.0499 1.7862 1.9152 1.7193 1.9346 2.6642 1.3876 2.0266 2.2382 1.4141 1.2437 1.2797 1.1690 1.2884 1.5474 1.4810 1.4624 2.4117 1.6158 1.2535 1.1744 1.0841 1.0950 1.1049 1.0691 1.1029 1.0904 1.0850 9.2824 6.6251 4.7129 1.0653 1.0412 1.0666 1.0586 1.0651 1.0596 1.0879 1.1003 1.0948 1.1016 1.0951 1.1002 1.0745 1.0818 1.0959 1.1142
irintensity: 1.4034 0.9900 2.5391 0.3713 0.4588 0.7927 0.2763 0.4478 0.5818 4.4675 2.1401 3.4833 3.9717 2.6896 4.0719 3.9160 2.1931 3.9428 5.9163 13.2252 5.3570 5.3736 0.4422 4.0412 13.3162 9.2265 1.9688 81.1286 1.7605 5.0222 10.7729 0.2075 13.4036 0.9956 8.3122 33.4202 5.1497 12.4983 20.4034 2.4825 6.8324 0.4506 4.4103 7.3696 7.0968 8.8351 12.8903 1.3406 33.3821 7.2717 38.8309 4.0502 11.3986 23.9422 1.4688 19.9788 8.9355 11.5720 16.9757 173.3200 40.6362 22.3638 23.4643 21.2141 14.8838 15.2051 27.8679 28.2637 53.7925 5.9344 16.1852 46.1491 20.0315 8.7429 34.7925 9.8443 21.7202 34.0337
temp: 298.150 k
press: 1.00000 atm
elementType: 8 6 6 6 6 6 6 6 6 6 6 6 1 1 1 1 1 1 1 1 1 1 1 1 1 1 1 1
symmnumber: 1
zpe: 630858.4 jmol-1
zpe.correction: 0.240281 hartree
zpe.thermalcorrener: 0.253312 hartree
zpe.thermalcorrenthalpy: 0.254256 hartree
zpe.thermalcorrgfe: 0.199988 hartree
zpe.sumelectzpe: -503.040643 hartree
zpe.sumelectthermal: -503.027613 hartree
zpe.sumelectthermalent: -503.026669 hartree
zpe.sumelectthermalfe: -503.080936 hartree
dipole: -2.1639 3.8667 0.4998
dipole: 4.4591
quadrupole: -68.3624 -78.5478 -73.1831
quadrupole: -1.2293 -2.2208 0.1921
quadrupole: 5.0020 -5.1834 0.1814 -1.2293 -2.2208 0.1921
hfenergy: -503.2809242 hartree
pointgroup: C01 [X(C11H16O1)]
dipole: 0.8217153 1.5408008 -0.1686943 debye
polarizability: 147.6882935|1.2435028|133.013329|-3.8649223|-4.2146041|81.9042397 unknown
InChI: InChI=1S/C11H16O/c1-3-4-7-10-9(2)6-5-8-11(10)12/h3H,1,4-8H2,2H3
charge 0 multiplicity 1
28 atoms
O  0.47754 -2.36092 0.167068
C  2.427359 1.348416 -0.307317
C  3.232485 0.080221 0.038325
C  0.332479 0.040131 0.296664
C  0.960005 1.253445 0.095129
C  2.497097 -1.167015 -0.488622
C  1.056612 -1.238173 0.021516
C  -1.115491 -0.109178 0.737129
C  0.261956 2.589289 0.245286
C  -2.095506 -0.25303 -0.470647
C  -3.522097 -0.477353 -0.019071
C  -4.578814 0.318355 -0.323076
H  2.482862 1.541181 -1.401876
H  2.876061 2.239942 0.174379
H  4.250386 0.139866 -0.390114
H  3.342767 0.004671 1.137621
H  3.005968 -2.106644 -0.21129
H  2.459313 -1.138415 -1.598643
H  -1.195145 -1.027901 1.346975
H  -1.435058 0.73858 1.368463
H  0.626655 3.116629 1.150126
H  -0.833176 2.50633 0.315978
H  0.504976 3.24456 -0.613937
H  -1.757156 -1.118386 -1.07514
H  -2.036843 0.644724 -1.116241
H  -3.684766 -1.365666 0.612495
H  -5.58933 0.097587 0.039268
H  -4.462839 1.212155 -0.949649
