program: Gaussian 09
title: 000278258
version: EM64L-G09RevD.01
frameworkgroup: C1[X(C15H24O6)]
method: RPBEPBE
basis: SDD
operation: Freq
keyword: #pfreq=noraman
keyword: PBEPBE/SDD
title: #p freq=noraman PBEPBE/SDD
converged: YES YES NO NO
title: Mulliken charges:
elementType: O O O O O O C C C C C C C C C C C C C C C H H H H H H H H H H H H H H H H H H H H H H H H
charge: -0.249925 -0.301637 -0.246688 -0.451987 -0.304292 -0.221773 -0.135319 -0.143730 -0.111944 -0.043179 0.362562 -0.417811 -0.148652 -0.440644 -0.433234 -0.394042 -0.391873 -0.389578 -0.679832 -0.686967 0.219912 0.266265 0.245364 0.256520 0.253621 0.264774 0.273516 0.240365 0.225195 0.210670 0.202747 0.221185 0.206640 0.194813 0.195506 0.208079 0.204664 0.196317 0.220490 0.248592 0.220847 0.237317 0.218631 0.224016 0.374499
chargesum: 0.00000
title: Mulliken charges with hydrogens summed into heavy atoms:
elementType: O O O O O O C C C C C C C C C C C C C C C
charge: -0.249925 -0.301637 -0.246688 -0.077487 -0.304292 -0.221773 0.130946 0.101633 0.144576 0.210442 0.362562 0.120479 0.091713 -0.004780 -0.009302 0.007410 0.011712 0.011403 0.010096 -0.007003 0.219912
polarizability: 2.18136360e+02 -1.69364258e+00 1.57077230e+02 2.02466790e+00 -2.97823249e+00 1.53148339e+02
1716.lowfreq: -7.9058 -3.6181 -0.0006 -0.0005 0.0003 5.3230 18.9304 26.0912 29.0986
frequency: 17.0312 25.9407 28.9899 37.2517 60.4126 71.4016 83.8646 105.6641 146.0266 168.2744 183.3089 187.3686 221.7400 228.3989 236.9806 239.2799 280.0618 294.1177 299.3506 326.7184 343.3815 355.5225 382.8039 424.4123 429.3340 430.7563 484.9545 496.5704 519.0309 550.3345 577.1088 592.8404 634.6268 676.3617 697.7013 722.1999 725.7161 746.0426 784.0883 788.3397 797.1210 815.4264 829.7518 848.8376 863.8484 881.6625 883.3894 893.7618 920.9498 924.2870 937.1902 939.5403 948.1599 967.3257 983.3825 998.2077 1007.5082 1033.6529 1039.2401 1047.3963 1053.6565 1072.7615 1075.3882 1087.7621 1113.2043 1129.8907 1138.6547 1144.6264 1172.9983 1179.3360 1212.2636 1227.4377 1240.5916 1242.1739 1251.2607 1258.1171 1264.4356 1266.5561 1271.3899 1287.2943 1299.3902 1307.7374 1310.5110 1323.5874 1325.5611 1329.3104 1337.8785 1344.8190 1346.5343 1353.1970 1357.5416 1379.0037 1383.9994 1391.7764 1448.6035 1450.0647 1453.3184 1462.1653 1463.3439 1464.3902 1467.2520 1470.6085 1475.0420 1477.4080 1647.9554 2968.3472 2970.5315 2971.5290 2978.4431 2988.5730 3000.7411 3004.4875 3005.4674 3008.8731 3022.4019 3030.6091 3033.3699 3038.9743 3045.0382 3056.7842 3059.9837 3062.2088 3099.1461 3108.2653 3108.9118 3113.1928 3117.4652 3146.1311 3516.0601
redmass: 4.6891 3.8145 5.5007 4.0002 4.0474 4.7258 4.8994 4.2138 4.7063 1.1016 3.5403 3.7893 1.9062 1.1764 4.7178 2.7003 4.7012 3.6069 3.8701 2.9872 2.2859 3.0516 3.1529 3.4285 3.3528 3.5359 3.1376 1.6884 4.2063 1.1402 4.3950 4.1321 5.1218 4.3599 6.6493 6.4140 4.2565 4.4942 2.2679 1.4835 5.9747 4.3493 3.4578 4.1974 3.0920 1.6954 3.0637 1.5666 1.4803 1.8914 3.4545 3.1434 3.1182 3.1190 1.3144 3.6279 3.3301 2.2818 3.7508 1.7122 1.5992 1.4199 2.2337 2.5824 2.3025 2.5715 1.9085 2.4222 1.2862 1.4290 2.6137 1.2172 2.4961 1.3881 1.4822 1.2952 1.2754 1.4410 1.3357 1.2650 1.2648 1.3044 1.4051 1.3036 1.1476 1.4939 1.3660 1.4757 1.4802 1.3493 1.4887 1.2900 1.5676 1.2237 1.0502 1.0940 1.0491 1.0855 1.0866 1.0875 1.0578 1.0829 1.0522 1.0921 9.6613 1.0642 1.0627 1.0612 1.0612 1.0612 1.0360 1.0513 1.0672 1.0854 1.0872 1.0981 1.0946 1.1025 1.1039 1.1022 1.0877 1.0578 1.1000 1.0992 1.0901 1.1006 1.1002 1.1091 1.0656
irintensity: 0.2853 0.6538 1.0592 0.3598 2.7316 1.7179 2.1881 1.6767 1.0891 0.0362 1.0877 3.4097 0.4059 1.2901 4.1970 5.9530 1.3093 7.2376 4.6904 15.9992 2.8742 5.6719 4.3583 0.4516 6.6171 6.7926 2.0016 3.4443 15.6086 115.8585 6.9304 9.1557 3.6138 7.2542 11.0793 10.7621 24.9785 23.5075 3.7222 0.1342 9.0501 72.5303 14.1323 13.6060 17.6320 0.7699 36.0488 11.6575 1.8034 0.8892 15.5378 185.6976 155.3674 24.8934 0.2814 178.2161 68.2422 19.1631 101.3496 3.5114 0.7816 24.1002 18.9971 185.7888 1.1934 1.2798 74.4901 32.8769 18.5830 2.6900 113.6159 14.2377 38.7543 26.8466 10.6487 0.4683 0.8183 10.3177 11.6136 3.8781 30.9875 25.4736 31.2133 1.5000 2.8590 2.4549 0.4595 1.3106 3.0689 6.4829 12.8085 37.2942 17.8684 25.4815 1.1442 19.9938 3.6852 0.3972 10.2192 13.2545 4.5562 21.7527 14.6781 3.6020 130.3309 35.2995 29.2602 33.8640 31.8441 18.2238 10.5958 13.1286 4.9518 4.5389 42.9063 75.8306 58.1990 11.7317 21.0798 93.9199 15.6673 13.8672 2.2564 32.5443 18.9757 17.5388 29.9111 2.9976 50.7752
temp: 298.150 k
press: 1.00000 atm
elementType: 8 8 8 8 8 8 6 6 6 6 6 6 6 6 6 6 6 6 6 6 6 1 1 1 1 1 1 1 1 1 1 1 1 1 1 1 1 1 1 1 1 1 1 1 1
symmnumber: 1
zpe: 989199.7 jmol-1
zpe.correction: 0.376766 hartree
zpe.thermalcorrener: 0.397907 hartree
zpe.thermalcorrenthalpy: 0.398851 hartree
zpe.thermalcorrgfe: 0.324577 hartree
zpe.sumelectzpe: -1035.665688 hartree
zpe.sumelectthermal: -1035.644547 hartree
zpe.sumelectthermalent: -1035.643603 hartree
zpe.sumelectthermalfe: -1035.717878 hartree
dipole: 2.8283 1.5366 0.9961
dipole: 3.3694
quadrupole: -115.7606 -125.7689 -132.3481
quadrupole: -5.3737 3.7692 -3.6589
quadrupole: 8.8652 -1.1430 -7.7222 -5.3737 3.7692 -3.6589
hfenergy: -1036.0424545 hartree
pointgroup: C01 [X(C15H24O6)]
dipole: -1.0807734 -0.3602903 0.6777579 debye
polarizability: 217.9668995|-1.8544786|158.6377636|-3.8820404|0.1020581|151.757265 unknown
InChI: InChI=1S/C15H24O6/c1-15(2)20-12-11(16)10(19-14(12)21-15)8-18-13(17)9-6-4-3-5-7-9/h9-12,14,16H,3-8H2,1-2H3
charge 0 multiplicity 1
45 atoms
O  2.437463 1.259523 -1.214988
O  3.214778 -1.011163 0.875642
O  4.585223 0.273942 -0.569969
O  0.874739 1.735742 1.529334
O  -1.197185 1.361799 -0.402066
O  -1.791707 -0.318391 -1.907048
C  2.812828 0.40143 1.023793
C  1.2972 0.531489 0.809793
C  3.480254 1.122259 -0.177936
C  1.165069 0.657978 -0.736019
C  4.293433 -1.126552 -0.157906
C  0.051095 1.612459 -1.191008
C  -3.250961 0.160735 0.034138
C  -4.56044 0.066174 -0.796975
C  -3.055881 -1.126513 0.897084
C  -5.781353 -0.189785 0.115962
C  -4.281044 -1.371984 1.807304
C  -5.58815 -1.45533 0.98448
C  3.767986 -1.945785 -1.341139
C  5.556655 -1.694586 0.486653
C  -2.05015 0.339181 -0.875936
H  3.117805 0.793133 2.007889
H  0.770347 -0.366214 1.1850
H  3.901869 2.121481 -0.001536
H  1.035945 -0.34389 -1.187326
H  -0.169089 1.48995 -2.262953
H  0.326175 2.649963 -0.954556
H  -3.305452 1.033215 0.712698
H  -4.453768 -0.756575 -1.530076
H  -4.705572 0.998004 -1.376478
H  -2.136952 -1.03605 1.509038
H  -2.915472 -1.98949 0.216307
H  -6.69243 -0.287084 -0.505006
H  -5.938751 0.687274 0.777682
H  -4.362922 -0.547293 2.545081
H  -4.130062 -2.30395 2.385119
H  -6.454968 -1.591712 1.659049
H  -5.548427 -2.347357 0.326043
H  3.43663 -2.939456 -0.993144
H  2.923582 -1.429823 -1.825163
H  4.566891 -2.079033 -2.090738
H  5.849473 -1.077901 1.351781
H  5.374958 -2.727847 0.828237
H  6.383713 -1.700799 -0.24396
H  -0.09757 1.858236 1.364022
