program: Gaussian 09
title: 000278217
version: EM64L-G09RevD.01
frameworkgroup: C1[X(C13H22O)]
method: RPBEPBE
basis: SDD
operation: Freq
keyword: #pfreq=noraman
keyword: PBEPBE/SDD
title: #p freq=noraman PBEPBE/SDD
converged: YES YES NO NO
title: Mulliken charges:
elementType: O C C C C C C C C C C C C C H H H H H H H H H H H H H H H H H H H H H H
charge: -0.449862 0.246546 0.115109 0.352389 -0.502529 -0.118023 -0.471599 -0.467822 -0.443233 -0.768854 -0.424168 -0.442898 -0.748877 -0.731549 0.208874 0.213694 0.223903 0.204168 0.195836 0.200568 0.227880 0.214415 0.207283 0.216695 0.213167 0.224868 0.234560 0.214118 0.210704 0.231014 0.205725 0.218557 0.220872 0.219146 0.215110 0.334213
chargesum: 0.00000
title: Mulliken charges with hydrogens summed into heavy atoms:
elementType: O C C C C C C C C C C C C C
charge: -0.115648 0.246546 0.115109 0.352389 -0.079961 0.105880 -0.071596 -0.039374 -0.021535 -0.114124 -0.189607 -0.018076 -0.093581 -0.076422
polarizability: 1.50802550e+02 -5.92551986e+00 1.38799431e+02 5.47840111e+00 -3.51726930e+00 1.18954481e+02
1716.lowfreq: -23.2689 -0.0006 0.0003 0.0004 2.3976 24.6010 66.2094 89.4287 141.7572
frequency: 65.3887 89.3820 141.7117 163.7625 180.2142 219.3304 245.3776 254.4622 268.8157 279.4501 288.6150 300.1078 324.1206 337.6479 348.1087 363.6056 403.3840 425.9375 454.8947 474.8027 482.5941 520.0835 568.7090 626.2660 661.5725 677.0581 768.5138 792.7385 813.4915 845.1942 863.8219 881.5713 899.7311 912.6989 933.0121 939.6578 946.2726 971.2058 983.6492 1000.8692 1007.7937 1027.3558 1041.1560 1073.2805 1099.4034 1107.0486 1132.4795 1146.4893 1152.0770 1167.9018 1178.2161 1194.5901 1207.6378 1231.6026 1242.2674 1258.0061 1279.0415 1309.6723 1323.3415 1329.2468 1339.2403 1342.4960 1350.5632 1358.1818 1364.9864 1376.9029 1383.8033 1395.8933 1453.0177 1454.5574 1457.0666 1461.6571 1465.4954 1473.1335 1477.4914 1480.6007 1483.8314 1487.9952 1501.7291 1649.3610 2944.9512 2958.5217 2968.1780 2977.3326 2978.8363 2983.9131 2984.4428 2994.1541 2998.2454 3018.2431 3023.8511 3029.0576 3045.4839 3051.8207 3064.8120 3069.6345 3072.9723 3093.1632 3095.6824 3108.1295 3117.2795 3530.5181
redmass: 3.4328 2.9567 1.1810 1.7403 2.3549 1.6520 2.4324 2.2742 1.5296 1.7989 1.7506 2.4003 1.5146 2.3489 2.7007 1.6743 2.4701 2.7956 2.7453 2.8075 2.9811 3.0486 2.5657 3.7407 3.2240 2.5431 2.2004 1.9231 1.4521 3.0692 2.1836 1.6365 2.0152 2.2609 1.6349 1.8761 1.6675 2.0308 1.6585 1.7670 1.5777 1.9846 2.1607 1.6701 1.5381 1.6426 2.1636 1.3370 2.2703 1.5051 2.6283 2.2426 1.9538 1.5842 1.6658 1.4986 1.5901 1.4621 1.6772 1.4870 1.4906 1.4440 1.4858 1.4138 1.1688 1.2220 1.2117 1.1967 1.0835 1.0823 1.0683 1.0620 1.0613 1.0760 1.0568 1.0848 1.0645 1.0612 1.0547 7.1495 1.0640 1.0611 1.0595 1.0383 1.0399 1.0388 1.0711 1.0646 1.0840 1.0966 1.0941 1.0899 1.1030 1.1011 1.0990 1.0963 1.0980 1.0989 1.0987 1.0955 1.0885 1.0654
irintensity: 0.8675 1.4142 0.4497 0.3976 9.4350 0.7077 3.8552 0.7985 10.5703 17.4117 2.4523 1.0411 49.4141 1.6351 2.6991 22.8683 0.1577 0.8942 0.2960 6.0594 4.9503 1.0927 3.2671 8.8863 1.6124 0.8322 1.4650 10.2029 5.7130 8.0690 2.4530 8.0998 8.1020 12.9266 1.6554 5.7065 10.0481 34.0994 14.8049 15.4730 1.6011 13.3873 15.2613 12.9101 3.9953 5.6132 1.4439 9.1731 9.2319 0.7570 1.3142 1.7719 16.5243 0.3125 12.4361 3.7501 3.4212 0.9306 1.1730 0.4609 1.9939 1.6704 3.9522 1.4808 20.5564 15.5455 18.5300 23.8257 10.6163 1.2496 2.1480 4.9376 4.7956 21.4099 12.5397 11.7798 16.5606 8.1095 14.5750 0.8212 43.1394 13.6360 60.6876 15.1218 37.0506 39.7426 8.9934 21.2572 48.6885 4.4902 93.9872 52.3160 56.7845 45.9972 10.9480 42.8431 60.8530 17.4243 37.4001 33.3674 21.9745 2.1872
temp: 298.150 k
press: 1.00000 atm
elementType: 8 6 6 6 6 6 6 6 6 6 6 6 6 6 1 1 1 1 1 1 1 1 1 1 1 1 1 1 1 1 1 1 1 1 1 1
symmnumber: 1
zpe: 843927.5 jmol-1
zpe.correction: 0.321435 hartree
zpe.thermalcorrener: 0.335874 hartree
zpe.thermalcorrenthalpy: 0.336818 hartree
zpe.thermalcorrgfe: 0.282435 hartree
zpe.sumelectzpe: -582.667346 hartree
zpe.sumelectthermal: -582.652907 hartree
zpe.sumelectthermalent: -582.651963 hartree
zpe.sumelectthermalfe: -582.706346 hartree
dipole: -1.9058 -0.0598 1.3434
dipole: 2.3324
quadrupole: -90.3957 -85.5115 -90.6741
quadrupole: -0.6193 6.9935 -0.7877
quadrupole: -1.5352 3.3489 -1.8137 -0.6193 6.9935 -0.7877
hfenergy: -582.9887812 hartree
pointgroup: C01 [X(C13H22O1)]
dipole: -0.7629549 -0.0015772 0.5098888 debye
polarizability: 150.8274118|-4.8522811|137.6742159|6.9202758|-5.1342276|120.0548344 unknown
InChI: InChI=1S/C13H22O/c1-12(2)10-6-4-5-8-13(10,3)9-7-11(12)14/h6,11,14H,4-5,7-9H2,1-3H3
charge 0 multiplicity 1
36 atoms
O  2.238179 -0.211112 -1.765536
C  -0.758246 -0.923947 0.209441
C  1.337687 0.748567 0.378123
C  -0.16811 0.508044 0.066952
C  0.222386 -1.983803 -0.3884
C  2.190104 -0.38171 -0.295468
C  -2.092524 -1.018186 -0.595873
C  1.687743 -1.798599 0.051835
C  -3.079105 0.111872 -0.245598
C  -1.055237 -1.288709 1.700277
C  -0.967926 1.542815 -0.329638
C  -2.454182 1.471116 -0.628345
C  1.852926 2.118087 -0.146055
C  1.608596 0.745639 1.917158
H  0.176859 -1.936837 -1.496029
H  -0.133815 -2.995392 -0.110234
H  3.245825 -0.264405 0.011882
H  -2.550429 -2.010801 -0.413566
H  -1.862939 -0.964552 -1.680606
H  1.802692 -1.983532 1.137053
H  2.330992 -2.532393 -0.468229
H  -3.305452 0.090896 0.837494
H  -4.040873 -0.031765 -0.773705
H  -1.714426 -2.177359 1.739797
H  -0.139291 -1.537552 2.261792
H  -1.557909 -0.462573 2.232334
H  -0.524066 2.538497 -0.456033
H  -2.973346 2.300251 -0.105427
H  -2.607748 1.665392 -1.712286
H  1.648602 2.260505 -1.220059
H  1.406365 2.957722 0.417057
H  2.948983 2.169179 -0.010247
H  0.989238 1.517751 2.408221
H  1.388661 -0.21799 2.401142
H  2.671998 0.985877 2.109662
H  1.311193 -0.055692 -2.084685
