program: Gaussian 09
title: 000278207
version: EM64L-G09RevD.01
frameworkgroup: C1[X(C12H20)]
method: RPBEPBE
basis: SDD
operation: Freq
keyword: #p
keyword: freq=noraman
keyword: PBEPBE/SDD
title: #p freq=noraman PBEPBE/SDD
converged: YES YES NO NO
title: Mulliken charges:
elementType: C C C C C C C C C C C C H H H H H H H H H H H H H H H H H H H H
charge: 0.270039 0.268339 -0.459661 -0.453572 -0.594919 -0.419015 -0.454620 -0.386978 0.170235 -0.783613 -0.491566 -0.823378 0.198884 0.198811 0.194383 0.199333 0.207310 0.210859 0.198362 0.202352 0.202402 0.204583 0.201847 0.199419 0.211814 0.224481 0.216346 0.209738 0.208666 0.220906 0.225623 0.222593
chargesum: 0.00000
title: Mulliken charges with hydrogens summed into heavy atoms:
elementType: C C C C C C C C C C C C
charge: 0.270039 0.268339 -0.061967 -0.059856 -0.176750 -0.018301 -0.047636 0.014287 0.170235 -0.130971 -0.073163 -0.154256
polarizability: 1.46668456e+02 4.92873647e+00 1.24745564e+02 -3.41105340e+00 1.13378722e-01 1.00429954e+02
1716.lowfreq: -20.1036 -0.0004 0.0002 0.0008 6.3811 17.3398 76.6976 112.4370 130.6082
frequency: 76.6656 112.4313 130.5891 139.9535 187.7826 239.5827 266.1321 297.0847 315.1251 330.7559 372.8108 392.3441 400.6021 415.1192 443.5196 482.3902 528.6633 564.6643 588.5518 655.2317 770.0549 799.5988 826.0525 844.7255 859.6185 884.3899 889.1773 921.7924 947.6113 968.6683 983.1187 990.0446 1012.2346 1035.0959 1056.3089 1075.9642 1083.7841 1116.8116 1131.7665 1142.9314 1143.9506 1171.3475 1188.4993 1198.2522 1200.0679 1247.5174 1261.5430 1265.3073 1305.2623 1315.7641 1329.5279 1335.2348 1339.4601 1342.2362 1348.4859 1353.5223 1379.0147 1392.6596 1448.9952 1454.5358 1456.4280 1463.4644 1463.5188 1467.6968 1470.9189 1474.1970 1477.0253 1487.7104 1490.6515 1673.5519 2935.8226 2951.7219 2951.9677 2957.9247 2961.1936 2968.7259 2973.8681 2975.7575 2977.7872 2992.7234 3009.5409 3019.8229 3023.0093 3024.1544 3037.9222 3040.3286 3056.7982 3065.5553 3082.7000 3094.0133
redmass: 2.6975 1.3925 1.6210 2.0127 1.1529 2.0915 2.0459 2.4482 2.4962 2.0802 1.9967 2.3275 2.9174 3.2391 2.4513 2.6201 2.3161 2.2146 3.0114 2.8773 2.6788 1.6541 1.7403 2.1628 1.6246 2.2498 1.5847 2.0056 1.8063 1.7903 1.6371 1.8164 1.4425 1.9041 1.6988 1.5893 1.6276 1.7104 1.8500 1.9706 1.7043 1.6720 2.2428 1.8838 1.9409 1.3018 1.3081 1.4372 1.8926 1.3598 1.5020 1.4780 1.5365 1.4227 1.4753 1.6959 1.2086 1.2160 1.0833 1.0848 1.0826 1.0796 1.0795 1.0602 1.0738 1.0853 1.0810 1.0770 1.0622 7.3168 1.0630 1.0595 1.0680 1.0424 1.0594 1.0586 1.0482 1.0574 1.0718 1.0829 1.0995 1.0977 1.0960 1.1000 1.1028 1.1027 1.0906 1.0971 1.0977 1.0937
irintensity: 0.2343 0.3215 0.0327 0.3271 0.3719 0.0776 0.8333 0.5516 0.3022 0.2715 0.6146 3.4076 0.9575 1.2229 0.7321 0.2112 0.9009 0.8423 0.3320 0.4435 1.8827 2.0189 4.8432 2.5326 0.4994 2.9555 4.2724 2.4936 0.4866 4.5387 8.4896 9.9704 3.4056 4.7534 1.2651 4.2352 0.4000 1.0475 1.9988 7.1078 2.1758 0.8372 0.4125 5.9185 2.6283 2.3028 3.4437 0.3470 0.1234 0.1275 0.4554 0.0699 0.9858 1.5295 0.3596 3.6288 19.4746 9.3992 0.8022 5.7487 9.1228 9.7856 5.0970 7.2292 13.1859 11.9734 4.6367 19.9173 8.2569 0.1869 44.1136 20.5969 24.1204 66.1637 53.7808 32.0559 29.9319 38.1095 30.0678 59.1243 33.9669 63.7070 25.6123 68.0013 32.6372 124.5330 46.2188 38.3180 34.2778 37.4568
temp: 298.150 k
press: 1.00000 atm
elementType: 6 6 6 6 6 6 6 6 6 6 6 6 1 1 1 1 1 1 1 1 1 1 1 1 1 1 1 1 1 1 1 1
symmnumber: 1
zpe: 761587.2 jmol-1
zpe.correction: 0.290073 hartree
zpe.thermalcorrener: 0.302137 hartree
zpe.thermalcorrenthalpy: 0.303081 hartree
zpe.thermalcorrgfe: 0.253271 hartree
zpe.sumelectzpe: -468.316137 hartree
zpe.sumelectthermal: -468.304073 hartree
zpe.sumelectthermalent: -468.303129 hartree
zpe.sumelectthermalfe: -468.352939 hartree
dipole: 0.0978 0.0253 -0.0633
dipole: 0.1192
quadrupole: -74.2193 -74.8935 -76.1485
quadrupole: 0.1911 -0.5375 0.2748
quadrupole: 0.8678 0.1936 -1.0614 0.1911 -0.5375 0.2748
hfenergy: -468.6062099 hartree
pointgroup: C01 [X(C12H20)]
dipole: 0.0379727 0.0105844 -0.0254148 debye
polarizability: 146.3133979|5.4703672|125.0311353|-3.8967913|-0.4449639|100.4994409 unknown
InChI: InChI=1S/C12H20/c1-10-6-5-9-12(2)8-4-3-7-11(10)12/h3-9H2,1-2H3
charge 0 multiplicity 1
32 atoms
C  -0.327321 -0.936378 0.11348
C  0.076383 0.556236 0.195127
C  -1.608404 -1.071717 -0.778223
C  0.793847 -1.796064 -0.539417
C  -1.068214 1.492447 0.579426
C  -2.775677 -0.152853 -0.357615
C  2.193209 -1.434732 -0.009552
C  -2.313963 1.320219 -0.331134
C  1.354323 0.990404 -0.047718
C  -0.624944 -1.492365 1.540918
C  2.504562 0.032675 -0.358792
C  1.799682 2.446063 -0.02901
H  -1.931817 -2.133107 -0.775663
H  -1.329108 -0.823685 -1.823549
H  0.781321 -1.633012 -1.637137
H  0.571054 -2.868856 -0.371935
H  -1.378136 1.280785 1.625216
H  -0.745718 2.54715 0.569695
H  -3.151938 -0.442415 0.644128
H  -3.622553 -0.279422 -1.060357
H  2.959874 -2.104717 -0.444193
H  2.232561 -1.572796 1.088472
H  -3.131434 1.97841 0.023284
H  -2.057528 1.641629 -1.36119
H  -0.992792 -2.534695 1.475551
H  0.287317 -1.487891 2.164029
H  -1.389864 -0.900087 2.072444
H  2.759716 0.115039 -1.438522
H  3.409704 0.373823 0.185613
H  2.458882 2.650714 -0.896027
H  2.399525 2.664856 0.87815
H  0.970053 3.169839 -0.063897
