program: Gaussian 09
title: 000278205
version: EM64L-G09RevD.01
frameworkgroup: C1[X(C11H14O3)]
method: RPBEPBE
basis: SDD
operation: Freq
keyword: #pfreq=noraman
keyword: PBEPBE/SDD
title: #p freq=noraman PBEPBE/SDD
converged: YES YES NO NO
title: Mulliken charges:
elementType: O O O C C C C C C C C C C C H H H H H H H H H H H H H H
charge: -0.273475 -0.224851 -0.234284 0.092275 -0.520712 0.490108 -0.498478 -0.456474 -0.559842 -0.521878 0.207259 -0.529105 0.177209 -0.505772 0.242467 0.230425 0.212778 0.238216 0.243186 0.225159 0.256824 0.233312 0.248132 0.242426 0.261017 0.241215 0.247173 0.235690
chargesum: 0.00000
title: Mulliken charges with hydrogens summed into heavy atoms:
elementType: O O O C C C C C C C C C C C
charge: -0.273475 -0.224851 -0.234284 0.092275 -0.047820 0.490108 -0.047484 0.011871 -0.069706 -0.031320 0.207259 -0.268088 0.177209 0.218306
polarizability: 1.38340530e+02 9.83725437e+00 1.29335577e+02 6.62055931e+00 -4.61662748e+00 9.80428664e+01
1716.lowfreq: -11.5549 -0.0011 -0.0011 -0.0006 3.8430 6.4878 24.3762 51.3379 92.2920
frequency: 23.6501 51.3086 92.2690 113.1296 118.4752 157.4640 167.3498 190.2129 240.1518 268.1148 299.0048 327.3885 392.3540 413.1168 440.5489 472.1503 520.3812 547.7883 586.4884 631.8227 684.4820 714.1946 733.6933 767.4229 792.6098 829.5112 876.3676 889.3446 909.7719 916.4363 940.2701 986.8758 1021.3703 1028.4706 1059.7404 1061.9755 1098.1985 1112.7487 1121.7085 1135.7488 1146.7397 1155.5377 1182.4065 1210.2490 1217.0789 1244.6558 1265.6645 1272.2895 1287.8342 1309.4436 1315.9329 1334.1754 1344.5973 1420.1983 1436.3036 1442.7399 1450.9409 1461.7456 1465.1254 1472.5455 1478.7070 1582.8002 1615.1376 1655.2694 2978.6230 2993.3784 2996.5493 3001.4279 3006.4877 3023.2567 3047.6974 3066.3178 3070.1566 3078.9143 3088.9113 3109.3267 3132.0097 3151.4545
redmass: 4.8478 4.9692 1.1084 2.5434 3.3841 3.1320 2.7935 3.7826 4.0389 2.2996 3.5992 3.2259 3.9440 6.7354 4.1240 3.8882 2.7678 3.2306 2.5349 3.3338 3.2325 5.8461 3.6921 2.8026 1.9493 2.5989 1.9531 2.0508 1.5041 2.4401 3.4693 2.3057 2.1852 1.9527 5.6228 1.9421 2.6972 1.2697 2.8956 1.2197 1.4577 1.6379 1.8536 1.4299 1.7104 1.7154 1.8610 1.9548 1.3662 1.3962 1.4413 1.9387 1.5030 1.1776 1.0793 1.0786 1.0505 1.0722 1.0625 1.0845 1.0964 10.0462 9.7037 8.8017 1.0663 1.0615 1.0635 1.0634 1.0294 1.0635 1.0983 1.0942 1.1007 1.0990 1.1051 1.1046 1.0925 1.1051
irintensity: 1.3871 3.6499 0.3178 0.5301 1.6056 2.0648 0.8971 6.0333 7.7953 1.5418 7.5467 7.3246 7.8781 3.7284 0.1555 6.3047 3.6198 3.9732 0.8787 5.5086 2.3854 1.9762 5.0427 6.9169 5.1626 5.0533 5.1926 1.1894 21.1909 5.3276 14.4761 10.0682 10.6619 0.5687 23.5902 61.0118 5.9579 0.5222 217.5794 0.2798 13.4870 4.2954 20.9625 5.9306 17.1301 39.7123 45.0342 7.9880 9.9764 1.7939 3.2857 25.1933 1.6692 14.0004 15.0519 11.2801 15.6774 4.3868 8.7422 27.7620 12.5398 196.3645 140.2580 96.2392 8.4285 18.6012 3.2364 53.1938 31.0944 30.7079 5.1020 19.2206 16.5795 18.6435 42.5065 21.9423 6.6830 13.7218
temp: 298.150 k
press: 1.00000 atm
elementType: 8 8 8 6 6 6 6 6 6 6 6 6 6 6 1 1 1 1 1 1 1 1 1 1 1 1 1 1
symmnumber: 1
zpe: 599608.7 jmol-1
zpe.correction: 0.228379 hartree
zpe.thermalcorrener: 0.241853 hartree
zpe.thermalcorrenthalpy: 0.242797 hartree
zpe.thermalcorrgfe: 0.187443 hartree
zpe.sumelectzpe: -652.174332 hartree
zpe.sumelectthermal: -652.160858 hartree
zpe.sumelectthermalent: -652.159914 hartree
zpe.sumelectthermalfe: -652.215268 hartree
dipole: 4.5549 1.3189 2.4321
dipole: 5.3293
quadrupole: -93.6644 -74.2267 -85.0137
quadrupole: -11.6542 -2.6218 -0.0512
quadrupole: -9.3628 10.0749 -0.7121 -11.6542 -2.6218 -0.0512
hfenergy: -652.4027113 hartree
pointgroup: C01 [X(C11H14O3)]
dipole: -1.8408217 0.4901787 -0.8759744 debye
polarizability: 139.2744576|-9.491701|128.6538294|4.7000756|5.721179|97.7906871 unknown
InChI: InChI=1S/C11H14O3/c1-14-10(13)11-5-2-3-8(11)7-9(12)4-6-11/h7H,2-6H2,1H3
charge 0 multiplicity 1
28 atoms
O  -1.937027 -1.520315 -0.274854
O  -1.568971 -0.14022 1.556106
O  3.507904 -1.168027 0.384815
C  -0.352208 0.302448 -0.576146
C  -1.179567 1.458794 -1.243586
C  0.659671 1.093533 0.266215
C  0.377867 -0.645806 -1.55645
C  -1.264025 2.553662 -0.145001
C  0.09703 2.463691 0.611939
C  1.394178 -1.528489 -0.795088
C  -1.309758 -0.452134 0.370821
C  1.907651 0.614447 0.542193
C  2.362441 -0.715995 0.077705
C  -2.935768 -2.261115 0.537201
H  -2.165672 1.123626 -1.609108
H  -0.602572 1.825814 -2.114348
H  0.912925 -0.022512 -2.299163
H  -0.346869 -1.275341 -2.099192
H  -2.091486 2.331236 0.550643
H  -1.442258 3.55603 -0.570692
H  -0.030638 2.575573 1.704012
H  0.80108 3.254105 0.28759
H  1.995357 -2.147144 -1.484206
H  0.852602 -2.234797 -0.131939
H  2.637815 1.202961 1.111433
H  -3.75347 -1.58722 0.843113
H  -2.457858 -2.680737 1.437923
H  -3.301578 -3.055671 -0.127735
